Bicyclo[3.1.1]heptane, 2,6,6-trimethyl-, [1S-(1α,2β,5α)]-
- Formula: C10H18
- Molecular weight: 138.2499
- IUPAC Standard InChIKey: XOKSLPVRUOBDEW-UHFFFAOYSA-N
- CAS Registry Number: 4755-33-3
- Chemical structure:
View 3d structure (requires JavaScript / HTML 5) - Species with the same structure:
- Stereoisomers:
- Other names: [1S-(1α,2β,5α)]-2,6,6-trimethylbicyclo[3.1.1]heptane; cis 2,6,6-trimethylbicyclo[3.1.1]heptane (cis-pinane)

Phase change data

Data compiled by: William E. Acree, Jr., James S. Chickos
Enthalpy of vaporization
ΔvapH (kJ/mol) | Temperature (K) | Reference | Comment |
---|---|---|---|
41.8 | 393. | Wang, Li, et al., 2003 | Based on data from 378. to 441. K. |

References

Wang, Li, et al., 2003
Wang, Congmin; Li, Haoran; Ma, Lu; Han, Shijun,
(Vapour+liquid) equilibria for the binary mixtures (cis-pinane+α-pinene) and (cis-pinane+1-butanol),
The Journal of Chemical Thermodynamics, 2003, 35, 1, 131-136, https://doi.org/10.1016/S0021-9614(02)00309-9
. [all data]