Thiepane
- Formula: C6H12S
- Molecular weight: 116.224
- IUPAC Standard InChIKey: JWCVYQRPINPYQJ-UHFFFAOYSA-N
- CAS Registry Number: 4753-80-4
- Chemical structure:
View 3d structure (requires JavaScript / HTML 5) - Other names: Hexamethylene sulfide; Thiacycloheptane; Thiepin, hexahydro-

Condensed phase thermochemistry data

Data compiled by: Hussein Y. Afeefy, Joel F. Liebman, and Stephen E. Stein
Quantity | Value | Units | Method | Reference | Comment |
---|---|---|---|---|---|
ΔfH°liquid | -113. ± 2. | kJ/mol | Ccr | Sunner, 1963 | See Sunner, 1962 |
Quantity | Value | Units | Method | Reference | Comment |
ΔcH°liquid | -4565.25 | kJ/mol | Ccr | Sunner, 1963 | See Sunner, 1962 |

Phase change data

Data compiled by: Robert L. Brown and Stephen E. Stein
Quantity | Value | Units | Method | Reference | Comment |
---|---|---|---|---|---|
Tboil | 446.7 | K | N/A | Weast and Grasselli, 1989 |

Normal alkane RI, non-polar column, custom temperature program

Column type | Active phase | I | Reference | Comment |
---|---|---|---|---|
Capillary | Methyl Silicone | 963. | Farkas, Héberger, et al., 2004 | Program: not specified |

References

Sunner, 1963
Sunner, S.,
Corrected heat of combustion and formation values for a number of organic sulphur compounds,
Acta Chem. Scand., 1963, 17, 728-730. [all data]
Sunner, 1962
Sunner, S.,
Corrected heat of combustion and formation values for a number of organic sulphur compounds,
Private communication, 1962, 1-4. [all data]
Weast and Grasselli, 1989
CRC Handbook of Data on Organic Compounds, 2nd Editon, Weast,R.C and Grasselli, J.G., ed(s)., CRC Press, Inc., Boca Raton, FL, 1989, 1. [all data]
Farkas, Héberger, et al., 2004
Farkas, O.; Héberger, K.; Zenkevich, I.G.,
Quantitative structure-retention relationships. XIV. Prediction of gas chromatographic retention indices for saturated O-, N-, and S-heterocyclic compounds,
Chemom. Intell. Lab. Syst., 2004, 72, 2, 173-184, https://doi.org/10.1016/j.chemolab.2004.01.012
. [all data]