Benzene, (1-methoxyethenyl)-
- Formula: C9H10O
- Molecular weight: 134.1751
- IUPAC Standard InChIKey: SIZDIMDMQQFWLM-UHFFFAOYSA-N
- CAS Registry Number: 4747-13-1
- Chemical structure:
View 3d structure (requires JavaScript / HTML 5) - Other names: Ether, methyl 1-phenylvinyl; α-Methoxystyrene; Methyl α-styryl ether; 1-Methoxy-1-phenylethene; 1-Methoxyvinylbenzene

Reaction thermochemistry data

Data compiled by: Hussein Y. Afeefy, Joel F. Liebman, and Stephen E. Stein
Individual Reactions
By formula: C9H10O + C6N4 = C15H10N4O
Quantity | Value | Units | Method | Reference | Comment |
---|---|---|---|---|---|
ΔrH° | -51.8 | kJ/mol | Cm | Solomonov, Antipin, et al., 1979 | liquid phase; solvent: methylene chloride |

Normal alkane RI, non-polar column, temperature ramp

Column type | Active phase | I | Reference | Comment |
---|---|---|---|---|
Capillary | OV-101 | 1084. | Zenkevich, Kharicheva, et al., 1999 | Helium, 60. C @ 0. min, 6. K/min, 240. C @ 0. min; Column length: 25. m; Column diameter: 0.20 mm |
Capillary | OV-101 | 1091. | Mandelshtam, Kharicheva, et al., 1991 | Helium, 50. C @ 0. min, 3. K/min, 220. C @ 0. min; Column length: 54. m; Column diameter: 0.26 mm |

References

Solomonov, Antipin, et al., 1979
Solomonov, B.N.; Antipin, I.S.; Konovalov, A.I.; Novikov, V.B.,
Solvation effects in the retro[2 + 2]cycloaddition reaction,
Zh. Org. Khim., 1979, 15, 2466-24. [all data]
Zenkevich, Kharicheva, et al., 1999
Zenkevich, I.G.; Kharicheva, E.M.; Kostikov, R.R.,
Application of Molecular Dynamics Methods in Chromato Mass Spectral Identification of Products of Interaction of Ethoxycarbonylcarbene with Various Substrates,
Zh. Org. Khim. (Rus.), 1999, 35, 11, 1600-1606. [all data]
Mandelshtam, Kharicheva, et al., 1991
Mandelshtam, T.V.; Kharicheva, E.M.; Gorobets, I.A.; Zenkevich, I.G.; Kostikov, R.R.; Porokhovnikova, E.B.,
Synthesis and Chromato Mass Spectrometric Investigation of alpha-Alkoxystyrenes,
Zh. Org. Khim. (Rus.), 1991, 27, 4, 684-690. [all data]