Propane, 1,1-diethoxy-
- Formula: C7H16O2
- Molecular weight: 132.2007
- IUPAC Standard InChIKey: MBNMGGKBGCIEGF-UHFFFAOYSA-N
- CAS Registry Number: 4744-08-5
- Chemical structure:
View 3d structure (requires JavaScript / HTML 5) - Other names: Propionaldehyde, diethyl acetal; Propanaldiethylacetal; 1,1-Diethoxypropane

Phase change data

Data compiled as indicated in comments:
BS - Robert L. Brown and Stephen E. Stein
TRC - Thermodynamics Research Center, NIST Boulder Laboratories, Chris Muzny director
Quantity | Value | Units | Method | Reference | Comment |
---|---|---|---|---|---|
Tboil | 396.0 | K | N/A | Aldrich Chemical Company Inc., 1990 | BS |
Tboil | 397. | K | N/A | Adams and Adkins, 1925 | Uncertainty assigned by TRC = 4. K; TRC |

Normal alkane RI, non-polar column, temperature ramp

Column type | Active phase | I | Reference | Comment |
---|---|---|---|---|
Capillary | DB-5 | 812. | Fan and Qian, 2006 | 30. m/0.32 mm/0.25 μm, He, 40. C @ 2. min, 4. K/min, 250. C @ 15. min |
Capillary | SPB-5 | 813. | Ledauphin, Guichard, et al., 2003 | 30. m/0.32 mm/0.25 μm, He, 40. C @ 1. min, 5. K/min, 220. C @ 20. min |
Capillary | BPX-5 | 817. | D'Arcy, Rintoul, et al., 1997 | 50. m/0.22 mm/0.25 μm, He, 50. C @ 1. min, 3. K/min, 250. C @ 10. min |

Normal alkane RI, non-polar column, custom temperature program

Column type | Active phase | I | Reference | Comment |
---|---|---|---|---|
Capillary | HP-5 | 814. | Zhao, Li, et al., 2008 | 30. m/0.25 mm/0.25 μm; Program: 40 0C (2 min) 5 0C/min -> 80 0C 7 oC/min -> 160 0C 9 0C/min -> 200 0C 20 0C/min -> 280 0C (10 min) |
Capillary | HP-5 | 813. | Zhao, Li, et al., 2008 | 30. m/0.25 mm/0.25 μm; Program: not specified |

Normal alkane RI, polar column, temperature ramp

Column type | Active phase | I | Reference | Comment |
---|---|---|---|---|
Capillary | DB-Wax | 950. | Fan and Qian, 2006 | 30. m/0.25 mm/0.25 μm, He, 40. C @ 2. min, 4. K/min, 230. C @ 15. min |
Capillary | DB-Wax | 950. | Fan and Qian, 2006 | 30. m/0.32 mm/0.25 μm, He, 40. C @ 2. min, 4. K/min, 230. C @ 15. min |

References

Aldrich Chemical Company Inc., 1990
Aldrich Chemical Company Inc.,
Catalog Handbook of Fine Chemicals, Aldrich Chemical Company, Inc., Milwaukee WI, 1990, 1. [all data]
Adams and Adkins, 1925
Adams, E.W.; Adkins, H.,
Catalysis in Acetal Formation,
J. Am. Chem. Soc., 1925, 47, 1358-67. [all data]
Fan and Qian, 2006
Fan, W.; Qian, M.C.,
Characterization of Aroma Compounds of Chinese Wuliangye and Jiannanchun Liquors by Aroma Extract Dilution Analysis,
J. Agric. Food Chem., 2006, 54, 7, 2695-2704, https://doi.org/10.1021/jf052635t
. [all data]
Ledauphin, Guichard, et al., 2003
Ledauphin, J.; Guichard, H.; Saint-Clair, J.-F.; Picoche, B.; Barillier, D.,
Chemical and sensorial aroma characterization of freshly distilled calvados. 2. Identification of volatile compounds and key odorants,
J. Agric. Food Chem., 2003, 51, 2, 433-442, https://doi.org/10.1021/jf020373e
. [all data]
D'Arcy, Rintoul, et al., 1997
D'Arcy, B.R.; Rintoul, G.B.; Rowland, C.Y.; Blackman, A.J.,
Composition of Australian honey extractives. 1. Norisoprenoids, monoterpenes, and other natural volatiles from blue gum (Eucalyptus leucoxylon) and yellow box (Eucalyptus melliodora) honeys,
J. Agric. Food Chem., 1997, 45, 5, 1834-1843, https://doi.org/10.1021/jf960625+
. [all data]
Zhao, Li, et al., 2008
Zhao, Y.; Li, J.; Xu, Y.; Duan, H.; Fan, W.; Zhao, G.,
EXtraction, preparation and identification of volatile compounds in Changyu XO brandy,
Chinese J. Chromatogr., 2008, 26, 2, 212-222, https://doi.org/10.1016/S1872-2059(08)60014-0
. [all data]