Thiophene, tetrahydro-3-methyl-
- Formula: C5H10S
- Molecular weight: 102.198
- IUPAC Standard InChIKey: DLABLFPCTXRQMY-UHFFFAOYSA-N
- CAS Registry Number: 4740-00-5
- Chemical structure:
View 3d structure (requires JavaScript / HTML 5) - Other names: 3-Methylthiolane; Tetrahydro-3-methylthiophene; 3-Methyltetrahydrothiophene; 3-Methylthiacyclopentane

Gas phase thermochemistry data

Data compiled by: Hussein Y. Afeefy, Joel F. Liebman, and Stephen E. Stein
Quantity | Value | Units | Method | Reference | Comment |
---|---|---|---|---|---|
ΔfH°gas | -60.54 ± 0.84 | kJ/mol | Ccr | Good, 1972 | Reanalyzed by Pedley, Naylor, et al., 1986, Original value = -60.17 ± 0.75 kJ/mol |

Condensed phase thermochemistry data

Data compiled as indicated in comments:
ALS - Hussein Y. Afeefy, Joel F. Liebman, and Stephen E. Stein
DH - Eugene S. Domalski and Elizabeth D. Hearing
Quantity | Value | Units | Method | Reference | Comment |
---|---|---|---|---|---|
ΔfH°liquid | -102.7 ± 0.79 | kJ/mol | Ccr | Good, 1972 | Reanalyzed by Pedley, Naylor, et al., 1986, Original value = -102.3 ± 0.71 kJ/mol; ALS |
Quantity | Value | Units | Method | Reference | Comment |
ΔcH°liquid | -3896.4 ± 0.59 | kJ/mol | Ccr | Good, 1972 | Reanalyzed by Pedley, Naylor, et al., 1986, Original value = -3895.8 ± 0.59 kJ/mol; ALS |
Quantity | Value | Units | Method | Reference | Comment |
S°liquid | 241.00 | J/mol*K | N/A | Messerly, Finke, et al., 1974 | DH |
Constant pressure heat capacity of liquid
Cp,liquid (J/mol*K) | Temperature (K) | Reference | Comment |
---|---|---|---|
171.80 | 298.15 | Messerly, Finke, et al., 1974 | T = 10 to 340 K.; DH |

Phase change data

Data compiled as indicated in comments:
TRC - Thermodynamics Research Center, NIST Boulder Laboratories, Chris Muzny director
ALS - Hussein Y. Afeefy, Joel F. Liebman, and Stephen E. Stein
DRB - Donald R. Burgess, Jr.
AC - William E. Acree, Jr., James S. Chickos
DH - Eugene S. Domalski and Elizabeth D. Hearing
Quantity | Value | Units | Method | Reference | Comment |
---|---|---|---|---|---|
Ttriple | 192.00 | K | N/A | Messerly, Finke, et al., 1974, 2 | Uncertainty assigned by TRC = 0.02 K; TRC |
Quantity | Value | Units | Method | Reference | Comment |
ΔvapH° | 42.1 ± 0.2 | kJ/mol | V | Good, 1972 | ALS |
ΔvapH° | 42.2 | kJ/mol | N/A | Good, 1972 | DRB |
ΔvapH° | 42.1 ± 0.1 | kJ/mol | N/A | Good, 1972 | See also Osborn and Douslin, 1966.; AC |
ΔvapH° | 42.7 | kJ/mol | N/A | Reid, 1972 | AC |
Enthalpy of vaporization
ΔvapH (kJ/mol) | Temperature (K) | Method | Reference | Comment |
---|---|---|---|---|
41.3 | 322. | N/A | Dykyj, Svoboda, et al., 1999 | Based on data from 307. to 439. K.; AC |
39.6 | 355. | A,EB | Stephenson and Malanowski, 1987 | Based on data from 340. to 453. K. See also Osborn and Douslin, 1966.; AC |
39.3 | 361. | N/A | White, Barnard--Smith, et al., 1952 | Based on data from 346. to 422. K.; AC |
Antoine Equation Parameters
log10(P) = A − (B / (T + C))
P = vapor pressure (bar)
T = temperature (K)
View plot Requires a JavaScript / HTML 5 canvas capable browser.
Temperature (K) | A | B | C | Reference |
---|---|---|---|---|
340.69 to 452.63 | 4.07601 | 1433.157 | -59.384 | Osborn and Douslin, 1966 |
Enthalpy of fusion
ΔfusH (kJ/mol) | Temperature (K) | Reference | Comment |
---|---|---|---|
10.3705 | 192.00 | Messerly, Finke, et al., 1974 | DH |
10.37 | 192. | Messerly, Finke, et al., 1974 | See also Domalski and Hearing, 1996.; AC |
Entropy of fusion
ΔfusS (J/mol*K) | Temperature (K) | Reference | Comment |
---|---|---|---|
54.01 | 192.00 | Messerly, Finke, et al., 1974 | DH |

Kovats' RI, non-polar column, isothermal

Column type | Active phase | Temperature (C) | I | Reference | Comment |
---|---|---|---|---|---|
Capillary | OV-101 | 100. | 869. | Gal'pern, Gollandskikh, et al., 1976 | H2; Column length: 100. m; Column diameter: 0.25 mm |

Normal alkane RI, non-polar column, custom temperature program

Column type | Active phase | I | Reference | Comment |
---|---|---|---|---|
Capillary | Methyl Silicone | 845. | Farkas, Héberger, et al., 2004 | Program: not specified |
Capillary | methyl silicone oil with 5% Igepal | 846. | Schultz, Flath, et al., 1988 | Column length: 150. m; Column diameter: 0.75 mm; Program: not specified |
Capillary | methyl silicone oil with 5% Igepal | 847. | Schultz, Flath, et al., 1988 | Column length: 150. m; Column diameter: 0.75 mm; Program: not specified |

References

Good, 1972
Good, W.D.,
Enthalpies of combustion of 18 organic sulfur compounds related to petroleum,
J. Chem. Eng. Data, 1972, 17, 158-162. [all data]
Pedley, Naylor, et al., 1986
Pedley, J.B.; Naylor, R.D.; Kirby, S.P.,
Thermochemical Data of Organic Compounds, Chapman and Hall, New York, 1986, 1-792. [all data]
Messerly, Finke, et al., 1974
Messerly, J.F.; Finke, H.L.; Todd, S.S.,
Low-temperature thermal studies on six organo-sulfur compounds,
J. Chem. Thermodynam., 1974, 6, 635-657. [all data]
Messerly, Finke, et al., 1974, 2
Messerly, J.F.; Finke, H.L.; Todd, S.S.,
Low-temperature thermal sudies on six organo-sulfur compounds,
J. Chem. Thermodyn., 1974, 6, 635-57. [all data]
Osborn and Douslin, 1966
Osborn, A.G.; Douslin, D.R.,
Vapor Pressure Relations of 36 Sulfur Compounds Present in Petroleum.,
J. Chem. Eng. Data, 1966, 11, 4, 502-509, https://doi.org/10.1021/je60031a014
. [all data]
Reid, 1972
Reid, Robert C.,
Handbook on vapor pressure and heats of vaporization of hydrocarbons and related compounds, R. C. Wilhort and B. J. Zwolinski, Texas A Research Foundation. College Station, Texas(1971). 329 pages.$10.00,
AIChE J., 1972, 18, 6, 1278-1278, https://doi.org/10.1002/aic.690180637
. [all data]
Dykyj, Svoboda, et al., 1999
Dykyj, J.; Svoboda, J.; Wilhoit, R.C.; Frenkel, M.L.; Hall, K.R.,
Vapor Pressure of Chemicals: Part A. Vapor Pressure and Antoine Constants for Hydrocarbons and Sulfur, Selenium, Tellurium and Hydrogen Containing Organic Compounds, Springer, Berlin, 1999, 373. [all data]
Stephenson and Malanowski, 1987
Stephenson, Richard M.; Malanowski, Stanislaw,
Handbook of the Thermodynamics of Organic Compounds, 1987, https://doi.org/10.1007/978-94-009-3173-2
. [all data]
White, Barnard--Smith, et al., 1952
White, P.T.; Barnard--Smith, D.G.; Fidler, F.A.,
Vapor Pressure--Temperature Relationships of Sulfur Compounds Related to Petroleum,
Ind. Eng. Chem., 1952, 44, 6, 1430-1438, https://doi.org/10.1021/ie50510a064
. [all data]
Domalski and Hearing, 1996
Domalski, Eugene S.; Hearing, Elizabeth D.,
Heat Capacities and Entropies of Organic Compounds in the Condensed Phase. Volume III,
J. Phys. Chem. Ref. Data, 1996, 25, 1, 1, https://doi.org/10.1063/1.555985
. [all data]