Pentane, 3-(chloromethyl)
- Formula: C6H13Cl
- Molecular weight: 120.620
- IUPAC Standard InChIKey: PQHNRODYYLFLRE-UHFFFAOYSA-N
- CAS Registry Number: 4737-41-1
- Chemical structure:
View 3d structure (requires JavaScript / HTML 5) - Other names: 3-(chloromethyl)pentane

Phase change data

Data compiled by: Thermodynamics Research Center, NIST Boulder Laboratories, Chris Muzny director
Quantity | Value | Units | Method | Reference | Comment |
---|---|---|---|---|---|
Tboil | 399.15 | K | N/A | Fourneau and Matti, 1931 | Uncertainty assigned by TRC = 3. K |

Normal alkane RI, non-polar column, custom temperature program

Column type | Active phase | I | Reference | Comment |
---|---|---|---|---|
Capillary | Methyl Silicone | 815. | Zenkevich, 1999 | Program: not specified |

References

Fourneau and Matti, 1931
Fourneau; Matti,
J. Pharm. Chim., 1931, 14, 513. [all data]
Zenkevich, 1999
Zenkevich, I.G.,
Mutual Correlation between Gas-Chromatographic Retention Indices of Organic Compounds from Different Series,
Zh. Anal. Khim., 1999, 54, 12, 1272-1279. [all data]