1,5,9-Cyclododecatriene, (Z,Z,Z)-
- Formula: C12H18
- Molecular weight: 162.2713
- IUPAC Standard InChIKey: ZOLLIQAKMYWTBR-MOLCZBCNSA-N
- CAS Registry Number: 4736-48-5
- Chemical structure:
View 3d structure (requires JavaScript / HTML 5) - Species with the same structure:
- Stereoisomers:
- Other names: 1,5,9-Cyclododecatriene, cis,cis,cis-; cis,cis,cis-1,5,9-Cyclododecatriene

Kovats' RI, non-polar column, isothermal

Column type | Active phase | Temperature (C) | I | Reference | Comment |
---|---|---|---|---|---|
Capillary | Squalane | 120. | 1294. | Schomburg, 1967 | Ar; Column length: 100. m |
Capillary | Squalane | 120. | 1290. | Schomburg, 1966 |

References

Schomburg, 1967
Schomburg, G.,
Struktur und Retentionsverhalten von Offenkettigen und Cyclischen Kohlenwasserstoffen und Deren Einfacher Substitutionsprodukte,
Anal. Chim. Acta., 1967, 38, 45-64, https://doi.org/10.1016/S0003-2670(01)80560-2
. [all data]
Schomburg, 1966
Schomburg, G.,
Gaschromatographische Retentionsdaten und struktur chemischer verbindungen. III. Alkylverzweigte und ungesättigte cyclische Kohlenwasserstoffe,
J. Chromatogr., 1966, 23, 18-41, https://doi.org/10.1016/S0021-9673(01)98653-4
. [all data]