Bicyclo[3.1.1]heptane, 2,6,6-trimethyl-
- Formula: C10H18
- Molecular weight: 138.2499
- IUPAC Standard InChIKey: XOKSLPVRUOBDEW-UHFFFAOYSA-N
- CAS Registry Number: 473-55-2
- Chemical structure:
View 3d structure (requires JavaScript / HTML 5) - Species with the same structure:
- Stereoisomers:
- Other names: Pinane; Dihydropinene; 2,6,6-Trimethylbicyclo(3.1.1)heptane; 1a,2b,5a-2,6,6-Trimethylbicyclo(3.1.1)heptane

Condensed phase thermochemistry data

Data compiled as indicated in comments:
ALS - Hussein Y. Afeefy, Joel F. Liebman, and Stephen E. Stein
DH - Eugene S. Domalski and Elizabeth D. Hearing
Quantity | Value | Units | Method | Reference | Comment |
---|---|---|---|---|---|
ΔcH°liquid | -1513.6 | kcal/mol | Ccb | Gollis, Belenyessy, et al., 1962 | Corresponding ΔfHºliquid = -41.75 kcal/mol (simple calculation by NIST; no Washburn corrections); ALS |
Constant pressure heat capacity of liquid
Cp,liquid (cal/mol*K) | Temperature (K) | Reference | Comment |
---|---|---|---|
55.40 | 313. | Gudinowicz, Campbell, et al., 1963 | T = 313 to 523 K.; DH |
55.31 | 311. | Gollis, Belenyessy, et al., 1962, 2 | Temperatures 100, 200, 300°F.; DH |

Phase change data

Data compiled by: Thermodynamics Research Center, NIST Boulder Laboratories, Chris Muzny director
Quantity | Value | Units | Method | Reference | Comment |
---|---|---|---|---|---|
Tboil | 440.9 | K | N/A | Pines, Hoffman, et al., 1954 | Uncertainty assigned by TRC = 2. K |
Tboil | 438. | K | N/A | Pines, Olberg, et al., 1952 | Uncertainty assigned by TRC = 4. K |
Tboil | 441.75 | K | N/A | Anonymous, 1942 | Uncertainty assigned by TRC = 0.3 K |
Quantity | Value | Units | Method | Reference | Comment |
Tfus | 220. | K | N/A | Timmermans, 1952 | Uncertainty assigned by TRC = 1. K |
Tfus | 193.05 | K | N/A | Anonymous, 1942 | Uncertainty assigned by TRC = 0.3 K |

References

Gollis, Belenyessy, et al., 1962
Gollis, M.H.; Belenyessy, L.I.; Gudzinowicz, B.J.; Koch, S.D.; Smith, J.O.; Wineman, R.J.,
Evaluation of pure hydrocarbons as jet fuels,
J. Chem. Eng. Data, 1962, 7, 331-316. [all data]
Gudinowicz, Campbell, et al., 1963
Gudinowicz, B.J.; Campbell, R.H.; Adams, J.S.,
Specific heat measurements of complex saturated hydrocarbons,
J. Chem. Eng. Data, 1963, 8, 201-214. [all data]
Gollis, Belenyessy, et al., 1962, 2
Gollis, M.H.; Belenyessy, L.I.; Gudzinowicz, B.J.; Koch, S.D.; Smith, J.O.; Wineman, R.J.,
Evaluations of pure hydrocarbons as Jet Fuels,
J. Chem. Eng. Data, 1962, 7, 311-316. [all data]
Pines, Hoffman, et al., 1954
Pines, H.; Hoffman, N.E.; Ipatieff, V.N.,
Studies in the Terpene Series XX. The Thermal Isomerization of Pinane at Atmospheric Pressure,
J. Am. Chem. Soc., 1954, 76, 4412. [all data]
Pines, Olberg, et al., 1952
Pines, H.; Olberg, R.C.; Ipatieff, V.N.,
J. Am. Chem. Soc., 1952, 74, 4872. [all data]
Anonymous, 1942
Anonymous, R.,
, Am. Pet. Inst. Res. Proj. 6, Natl. Bur. Stand., 1942. [all data]
Timmermans, 1952
Timmermans, J.,
Freezing points of organic compounds. VVI New determinations.,
Bull. Soc. Chim. Belg., 1952, 61, 393. [all data]