2-Ethoxy-1,3,5-trinitro-benzene
- Formula: C8H7N3O7
- Molecular weight: 257.1571
- CAS Registry Number: 4732-14-3

Condensed phase thermochemistry data

Data compiled by: Hussein Y. Afeefy, Joel F. Liebman, and Stephen E. Stein
Quantity | Value | Units | Method | Reference | Comment |
---|---|---|---|---|---|
ΔcH°solid | -3943.8 ± 3.9 | kJ/mol | Ccb | Badoche, 1942 | Reanalyzed by Cox and Pilcher, 1970, Original value = -3947.0 kJ/mol |
ΔcH°solid | -3944.1 ± 3.9 | kJ/mol | Ccb | Burlot, 1939 | Reanalyzed by Cox and Pilcher, 1970, Original value = -3959.2 kJ/mol |

Phase change data

Data compiled by: William E. Acree, Jr., James S. Chickos
Enthalpy of vaporization
ΔvapH (kJ/mol) | Temperature (K) | Method | Reference | Comment |
---|---|---|---|---|
120.5 | 346. | A | Stephenson and Malanowski, 1987 | Based on data from 342. to 351. K. |
Enthalpy of sublimation
ΔsubH (kJ/mol) | Temperature (K) | Method | Reference | Comment |
---|---|---|---|---|
79.0 | 358. | A | Stephenson and Malanowski, 1987 | Based on data from 352. to 364. K. |

References

Badoche, 1942
Badoche, M.,
Chaleurs de combustion de derives nitres phenoliques,
Bull. Soc. Chim. France, 1942, 9, 86-95. [all data]
Cox and Pilcher, 1970
Cox, J.D.; Pilcher, G.,
Thermochemistry of Organic and Organometallic Compounds, Academic Press, New York, 1970, 1-636. [all data]
Burlot, 1939
Burlot, E.,
Etude relative a la calorimetrie des explosifs,
Mem. Poudres, 1939, 29, 226-260. [all data]
Stephenson and Malanowski, 1987
Stephenson, Richard M.; Malanowski, Stanislaw,
Handbook of the Thermodynamics of Organic Compounds, 1987, https://doi.org/10.1007/978-94-009-3173-2
. [all data]