Bicyclo[2.2.1]heptane, 2,2,3-trimethyl-
- Formula: C10H18
- Molecular weight: 138.2499
- IUPAC Standard InChIKey: XETQTCAMTVHYPO-UHFFFAOYSA-N
- CAS Registry Number: 473-19-8
- Chemical structure:
View 3d structure (requires JavaScript / HTML 5) - Stereoisomers:
- Other names: Isocamphane; Dihydrocamphene

Kovats' RI, non-polar column, isothermal

Column type | Active phase | Temperature (C) | I | Reference | Comment |
---|---|---|---|---|---|
Packed | Apiezon L | 150. | 1039. | Luisetti and Yunes, 1971 | N2, Celite 545; Column length: 4. m |
Packed | Apiezon L | 175. | 1052. | Luisetti and Yunes, 1971 | N2, Celite 545; Column length: 4. m |
Packed | Apiezon L | 190. | 1060. | Luisetti and Yunes, 1971 | N2, Celite 545; Column length: 4. m |

Kovats' RI, polar column, isothermal

Column type | Active phase | Temperature (C) | I | Reference | Comment |
---|---|---|---|---|---|
Packed | PEG-20M | 150. | 1134. | Luisetti and Yunes, 1971 | N2, Celite 545; Column length: 4. m |

Phase change data

Data compiled by: Thermodynamics Research Center, NIST Boulder Laboratories, Chris Muzny director
Quantity | Value | Units | Method | Reference | Comment |
---|---|---|---|---|---|
Tfus | 336.7 | K | N/A | Smith, Fuzek, et al., 1949 | Uncertainty assigned by TRC = 0.5 K |
Tfus | 427. | K | N/A | Timmermans, 1935 | Uncertainty assigned by TRC = 2.5 K |
Tfus | 360. | K | N/A | Vavon, 1909 | Uncertainty assigned by TRC = 6. K |

References

Luisetti and Yunes, 1971
Luisetti, R.U.; Yunes, R.A.,
Correlation between molecular structure and GC retention of mono and sesquiterpenic hydrocarbons: The influence of shielding steric effects; a new polarity factor for stationary phases,
J. Chromatogr. Sci., 1971, 9, 10, 624-631, https://doi.org/10.1093/chromsci/9.10.624
. [all data]