occidentalol
- Formula: C15H24O
- Molecular weight: 220.3505
- IUPAC Standard InChIKey: AMZWKSYAMHGGSR-GZBFAFLISA-N
- CAS Registry Number: 473-17-6
- Chemical structure:
View 3d structure (requires JavaScript / HTML 5) - Stereoisomers:

Kovats' RI, non-polar column, temperature ramp

Column type | Active phase | I | Reference | Comment |
---|---|---|---|---|
Capillary | DB-5 | 1548. | Andersen, Gagnon, et al., 1995 | 2. K/min; Tstart: 40. C; Tend: 210. C |

Kovats' RI, polar column, temperature ramp

Column type | Active phase | I | Reference | Comment |
---|---|---|---|---|
Capillary | Supelcowax-10 | 2097. | Andersen, Gagnon, et al., 1995 | 2. K/min; Tstart: 40. C; Tend: 210. C |

Van Den Dool and Kratz RI, non-polar column, temperature ramp

Column type | Active phase | I | Reference | Comment |
---|---|---|---|---|
Capillary | HP-5MS | 1545. | Silva-Brandão, Solferini, et al., 2006 | 30. m/0.25 mm/0.25 μm, He, 3. K/min; Tstart: 60. C; Tend: 300. C |

Normal alkane RI, non-polar column, custom temperature program

Column type | Active phase | I | Reference | Comment |
---|---|---|---|---|
Capillary | SE-30 | 1538. | Vinogradov, 2004 | Program: not specified |
Capillary | DB-5 | 1548. | Jean, Garneau, et al., 1993 | Column length: 30. m; Column diameter: 0.25 mm; Program: not specified |

Normal alkane RI, polar column, custom temperature program

Column type | Active phase | I | Reference | Comment |
---|---|---|---|---|
Capillary | Supelcowax-10 | 2086. | Jean, Garneau, et al., 1993 | Column length: 30. m; Column diameter: 0.25 mm; Program: not specified |

References

Andersen, Gagnon, et al., 1995
Andersen, A.; Gagnon, H.; Collin, G.; Adams, R.P.,
Essential oil of the wood of Thuja occidentalis L.,
J. Essent. Oil Res., 1995, 7, 5, 489-495, https://doi.org/10.1080/10412905.1995.9698572
. [all data]
Silva-Brandão, Solferini, et al., 2006
Silva-Brandão, K.L.; Solferini, V.N.; Trigo, J.R.,
Chemical and phylogenetic relationships among Aristolochia L. (Aristolochiaceae) from southeastern Brazil,
Biochem. Syst. Ecol., 2006, 34, 4, 291-302, https://doi.org/10.1016/j.bse.2005.10.011
. [all data]
Vinogradov, 2004
Vinogradov, B.A.,
Production, composition, properties and application of essential oils, 2004, retrieved from http://viness.narod.ru. [all data]
Jean, Garneau, et al., 1993
Jean, F.-I.; Garneau, F.-X.; Collin, G.J.; Bouhajib, M.; Zamir, L.O.,
The essential oil and glycosidically bound volatile compounds of Taxus canadensis marsh,
J. Essent. Oil Res., 1993, 5, 1, 7-11, https://doi.org/10.1080/10412905.1993.9698163
. [all data]