2-Heptanol, 6-methyl-
- Formula: C8H18O
- Molecular weight: 130.2279
- IUPAC Standard InChIKey: FCOUHTHQYOMLJT-UHFFFAOYSA-N
- CAS Registry Number: 4730-22-7
- Chemical structure:
View 3d structure (requires JavaScript / HTML 5) - Other names: 2-Methylheptan-6-ol; 6-Methyl-2-heptanol; NSC 75858; 6-methylheptan-2-ol

Condensed phase thermochemistry data

Data compiled by: Eugene S. Domalski and Elizabeth D. Hearing
Constant pressure heat capacity of liquid
Cp,liquid (J/mol*K) | Temperature (K) | Reference | Comment |
---|---|---|---|
315.1 | 298.5 | Cline and Andrews, 1931 | T = 102 to 298 K. Value is unsmoothed experimental datum. |

Phase change data

Data compiled as indicated in comments:
BS - Robert L. Brown and Stephen E. Stein
TRC - Thermodynamics Research Center, NIST Boulder Laboratories, Chris Muzny director
AC - William E. Acree, Jr., James S. Chickos
Quantity | Value | Units | Method | Reference | Comment |
---|---|---|---|---|---|
Tboil | 445. ± 1. | K | AVG | N/A | Average of 8 values; Individual data points |
Quantity | Value | Units | Method | Reference | Comment |
Tfus | 212. | K | N/A | Buelens, 1908 | Uncertainty assigned by TRC = 5. K; TRC |
Enthalpy of vaporization
ΔvapH (kJ/mol) | Temperature (K) | Method | Reference | Comment |
---|---|---|---|---|
55.2 | 369. | A | Stephenson and Malanowski, 1987 | Based on data from 354. to 445. K. See also Wilhoit and Zwolinski, 1973.; AC |

Kovats' RI, non-polar column, temperature ramp

View large format table.

Column type Active phase I Reference Comment
CapillaryOV-101960.Ohnishi and Shibamoto, 19842. K/min; Column length: 50. m; Column diameter: 0.23 mm; Tstart: 80. C; Tend: 200. C
CapillaryOV-101960.Ohnishi and Shibamoto, 19842. K/min; Column length: 50. m; Column diameter: 0.23 mm; Tstart: 80. C; Tend: 200. C

Normal alkane RI, non-polar column, custom temperature program

View large format table.

Column type Active phase I Reference Comment
CapillaryMethyl Silicone951.Feng and Mu, 2007Program: not specified
CapillaryMethyl Silicone951.Estrada and Gutierrez, 1999Program: not specified

Normal alkane RI, polar column, temperature ramp

View large format table.

Column type Active phase I Reference Comment
CapillaryDB-Wax1379.Tanaka, Yamauchi, et al., 200330. m/0.25 mm/0.25 μm, 30. C @ 1. min, 4. K/min; Tend: 250. C
CapillaryDB-Wax1381.Tanaka, Yamauchi, et al., 200330. m/0.25 mm/0.25 μm, 30. C @ 1. min, 4. K/min; Tend: 250. C
CapillaryCarbowax 20M1352.Kawakami and Kobayashi, 1991He, 60. C @ 4. min, 2. K/min; Column length: 50. m; Column diameter: 0.25 mm; Tend: 180. C

Normal alkane RI, polar column, custom temperature program

View large format table.

Column type Active phase I Reference Comment
CapillaryDB-Wax1365.Peng, Yang, et al., 1991Program: not specified

References

Cline and Andrews, 1931
Cline, J.K.; Andrews, D.H.,
Thermal energy studies. III. The octanols,
J. Am. Chem. Soc., 1931, 53, 3668-3673. [all data]
Buelens, 1908
Buelens, A.,
Bull. Cl. Sci., 1908, 1908, 921-9. [all data]
Stephenson and Malanowski, 1987
Stephenson, Richard M.; Malanowski, Stanislaw,
Handbook of the Thermodynamics of Organic Compounds, 1987, https://doi.org/10.1007/978-94-009-3173-2
. [all data]
Wilhoit and Zwolinski, 1973
Wilhoit, R.C.; Zwolinski, B.J.,
Physical and thermodynamic properties of aliphatic alcohols,
J. Phys. Chem. Ref. Data Suppl., 1973, 1, 2, 1. [all data]