Benzoic acid, 2-[(phenylamino)carbonyl]-
- Formula: C14H11NO3
- Molecular weight: 241.2420
- IUPAC Standard InChIKey: DSUPUOGOCIFZBG-UHFFFAOYSA-N
- CAS Registry Number: 4727-29-1
- Chemical structure:
View 3d structure (requires JavaScript / HTML 5) - Other names: N-phenylphthalamic acid

Condensed phase thermochemistry data

Data compiled by: Eugene S. Domalski and Elizabeth D. Hearing
Quantity | Value | Units | Method | Reference | Comment |
---|---|---|---|---|---|
S°solid,1 bar | 322.9 | J/mol*K | N/A | Karyakin, Bazhan, et al., 1977 |
Constant pressure heat capacity of solid
Cp,solid (J/mol*K) | Temperature (K) | Reference | Comment |
---|---|---|---|
279.5 | 300. | Karyakin, Bazhan, et al., 1977 | T = 60 to 400 K. |

Reaction thermochemistry data

Data compiled by: Hussein Y. Afeefy, Joel F. Liebman, and Stephen E. Stein
Individual Reactions
By formula: C6H7N + C8H4O3 = C14H11NO3
Quantity | Value | Units | Method | Reference | Comment |
---|---|---|---|---|---|
ΔrH° | -53.5 | kJ/mol | Kin | Kalnin'sh, 1988 | liquid phase; solvent: Acetonitrile |
ΔrH° | -54.4 | kJ/mol | Kin | Pravednikov, Kardash, et al., 1973 | solid phase; solvent: Tetrahydrofuran |
By formula: C14H11NO3 = C14H9NO2 + H2O
Quantity | Value | Units | Method | Reference | Comment |
---|---|---|---|---|---|
ΔrH° | -15. | kJ/mol | Eqk | Karyakin, Bazhan, et al., 1977, 2 | solid phase |

References

Karyakin, Bazhan, et al., 1977
Karyakin, N.V.; Bazhan, N.G.; Sapozhnikov, V.N.; Shvetsova, K.G.; Berestneva, G.L.; Lomteva, A.N.; Zimin, Yu.B.; Korshak, V.V.,
Thermodynamics of synthesis of poly-(p,p'-diphenylene oxide)pyromellitimide,
Vysokomol. Soedin., 1977, A19, 1541-1548. [all data]
Kalnin'sh, 1988
Kalnin'sh, K.K.,
Autocatalysis and effects of the solvent in the reaction of phthalic anhydride with aniline derivatives,
Bull. Acad. Sci. USSR, Div. Chem. Sci., 1988, 1768-1773. [all data]
Pravednikov, Kardash, et al., 1973
Pravednikov, A.N.; Kardash, I.Ye.; Glukhoyedov, N.P.; Ardashnikov, A.Ya.,
Some features of the synthesis of heat-resistant heterocyclic polymers,
Polym. Sci. USSR, 1973, 15, 399-410. [all data]
Karyakin, Bazhan, et al., 1977, 2
Karyakin, N.V.; Bazhan, N.G.; Sapozhnikov, V.N.; Shvetsova, K.G.; Berestneva, G.L.; Lomteva, A.N.; Zimin, Yu.B.; Korshak, V.V.,
Thermodynamics of synthesis of poly-(p,p'-diphenyleneoxide)pyromellitimide,
Polym. Sci. USSR, 1977, 19, 1766-1775. [all data]