1,3-Cyclohexadiene, 1,3,5,5-tetramethyl-

Reaction thermochemistry data

Data compiled by: Hussein Y. Afeefy, Joel F. Liebman, and Stephen E. Stein

Individual Reactions

Cyclohexene, 1,5,5-trimethyl-3-methylene- = 1,3-Cyclohexadiene, 1,3,5,5-tetramethyl-

By formula: C10H16 = C10H16

Quantity Value Units Method Reference Comment
Δr2. ± 1.kJ/molCisoEgger and Jola, 1969gas phase

References

Egger and Jola, 1969
Egger, K.W.; Jola, M., 50. Nitrogen oxide (NO)-catalyzed isomerization of 3-methylene-1,5,5-trimethylcyclohexene to 1,3,4,5-tetramethyl-1,3-cyclohexadiene in the gas phase. Thermodynamic data from equilibrium measurement, Helv. Chim. Acta, 1969, 52, 449-453. [all data]