1-Phenanthrenecarboxaldehyde, 7-ethenyl-1,2,3,4,4a,4b,5,6,7,9,10,10a-dodecahydro-1,4a,7-trimethyl-, [1R-(1α,4aβ,4bα,7β,10aα)]-

Kovats' RI, non-polar column, isothermal

View large format table.

Column type Active phase Temperature (C) I Reference Comment
PackedOV-101200.2149.Kosyukova and Khorguani, 1989Chromaton N-AW-DMCS; Column length: 2.5 m
PackedOV-101210.2154.Kosyukova and Khorguani, 1989Chromaton N-AW-DMCS; Column length: 2.5 m

Kovats' RI, polar column, isothermal

View large format table.

Column type Active phase Temperature (C) I Reference Comment
PackedCarbowax 20M190.2749.Kosyukova and Khorguani, 1989Chromaton N-AW-DMCS; Column length: 2.5 m
PackedCarbowax 20M200.2761.Kosyukova and Khorguani, 1989Chromaton N-AW-DMCS; Column length: 2.5 m

Van Den Dool and Kratz RI, non-polar column, temperature ramp

View large format table.

Column type Active phase I Reference Comment
CapillarySE-542171.57Yin, Xiu, et al., 200135. C @ 3. min, 4. K/min, 230. C @ 10. min; Column length: 25. m; Column diameter: 0.31 mm

Normal alkane RI, non-polar column, temperature ramp

View large format table.

Column type Active phase I Reference Comment
CapillarySPB-12177.Escalona-Arranz, Perez-Roses, et al., 201030. m/0.32 mm/0.25 μm, Helium, 30. C @ 3. min, 4. K/min, 250. C @ 10. min

References

Kosyukova and Khorguani, 1989
Kosyukova, L.V.; Khorguani, T.V., Retention indices of diterpenes isolated from resins of coniferous trees, Zh. Anal. Khim., 1989, 44, 9, 1309-1313. [all data]

Yin, Xiu, et al., 2001
Yin, W.; Xiu, Z.; Aijin, H., Analysis of the volatile components in trogopterorum feces by capillary gas chromatography and gas chromatography/mass spectrometry, Fenxi Huaxue, 2001, 29, 2, 195-198. [all data]

Escalona-Arranz, Perez-Roses, et al., 2010
Escalona-Arranz, J.C.; Perez-Roses, R.; Jimenez, I.L.; Rodriguez-Amado, J.; Argota-Coello, H.; Canizares-Lay, J.; Morris-Quevedo, H.J.; Sierra-Gonzales, G., Chemical constituents of Tamarindus indica L. leaves, Rev. Cubana Quim., 2010, 22, 3, 65-71. [all data]