Calcium carbonate (precipitated)
- Formula: CCaO3
- Molecular weight: 100.087
- IUPAC Standard InChIKey: VTYYLEPIZMXCLO-UHFFFAOYSA-L
- CAS Registry Number: 471-34-1
- Chemical structure:
View 3d structure (requires JavaScript / HTML 5) - Species with the same structure:
- Other names: calcium carbonate

Reaction thermochemistry data

Data compiled by: Michael M. Meot-Ner (Mautner) and Sharon G. Lias
Individual Reactions
(Ca+2 • 4 •
) +
= (Ca+2 • 5
•
)
By formula: (Ca+2 • 4CO2 • CCaO3) + CO2 = (Ca+2 • 5CO2 • CCaO3)
Free energy of reaction
ΔrG° (kJ/mol) | T (K) | Method | Reference | Comment |
---|---|---|---|---|
32. | 296. | FA | Spears and Fehsenfeld, 1972 | gas phase |

References

Spears and Fehsenfeld, 1972
Spears, K.G.; Fehsenfeld, F.C.,
Termolecular Association Reactions of Mg, Ca, and Ba Ions,
J. Chem. Phys., 1972, 56, 11, 5698, https://doi.org/10.1063/1.1677091
. [all data]