6-octadecenoic acid

Normal alkane RI, non-polar column, temperature ramp

View large format table.

Column type Active phase I Reference Comment
CapillaryHP-5MS2073.Pitarokili, Tzakou, et al., 200630. m/0.25 mm/0.25 μm, He, 3. K/min; Tstart: 60. C; Tend: 280. C

References

Pitarokili, Tzakou, et al., 2006
Pitarokili, D.; Tzakou, O.; Loukis, A., Essential oil composition of Salvia verticillata, S. verbenaca, S. glutinosa and S. candidissima growing wild in Greece, Flavour Fragr. J., 2006, 21, 4, 670-673, https://doi.org/10.1002/ffj.1647 . [all data]