1,3-Propanediol, 2-(hydroxymethyl)-
- Formula: C4H10O3
- Molecular weight: 106.1204
- IUPAC Standard InChIKey: SFRDXVJWXWOTEW-UHFFFAOYSA-N
- CAS Registry Number: 4704-94-3
- Chemical structure:
View 3d structure (requires JavaScript / HTML 5) - Other names: Propane, 1,3-dihydroxy-2-hydroxymethyl-; 2-(hydroxymethyl)propane-1,3-diol

Reaction thermochemistry data

Data compiled by: Hussein Y. Afeefy, Joel F. Liebman, and Stephen E. Stein
Individual Reactions
By formula: C4H10O3 + HNO3 = C4H9NO5 + H2O
Quantity | Value | Units | Method | Reference | Comment |
---|---|---|---|---|---|
ΔrH° | -11.3 | kJ/mol | Cm | Tsvetkov, Sopin, et al., 1986 | liquid phase |

References

Tsvetkov, Sopin, et al., 1986
Tsvetkov, V.G.; Sopin, V.P.; Tsvetkova, L.Ya.; Marchenko, G.N.,
Enthalpy of reaction of nitric acid with some organic compounds,
J. Gen. Chem. USSR, 1986, 56, 471-474. [all data]