trans-Decalin, 2a-methyl

Condensed phase thermochemistry data

Data compiled by: Hussein Y. Afeefy, Joel F. Liebman, and Stephen E. Stein

Quantity Value Units Method Reference Comment
Δcliquid-6922. ± 2.kJ/molCcbKozina, Skuratov, et al., 1961Corresponding Δfliquid = -265. kJ/mol (simple calculation by NIST; no Washburn corrections)

Gas phase ion energetics data

Data compiled by: Sharon G. Lias, Rhoda D. Levin, and Sherif A. Kafafi

Ionization energy determinations

IE (eV) Method Reference
9.31 ± 0.006EIZaikin, Musaev, et al., 1978

Appearance energy determinations

Ion AE (eV) Other Products MethodReferenceComment
C10H17+10.33 ± 0.009CH3EIZaikin, Musaev, et al., 1978

References

Kozina, Skuratov, et al., 1961
Kozina, M.P.; Skuratov, S.M.; Shtekher, S.M.; Sosnina, I.E.; Turova-Polyak, M.B., Heats of combustion of some bicyclanes, Russ. J. Phys. Chem. (Engl. Transl.), 1961, 35, 1144-1146. [all data]