Ethypicone
- Formula: C10H15NO2
- Molecular weight: 181.2316
- IUPAC Standard InChIKey: WELBEQNHUMMKEL-UHFFFAOYSA-N
- CAS Registry Number: 467-90-3
- Chemical structure:
View 3d structure (requires JavaScript / HTML 5) - Other names: 3,3-Diethyl-5-methyl-2,4(1H,3H)-pyridinedione; 3,3-Diethyl-5-methyl-1,2,3,4-tetrahydropyridin-2,4-dione; Deshydromethylprylon; Dehydromethylprylon; Methylpersedon; 5-Methylpyrithyldione; Deshydromethyprylon; Methyprylon M (OH, -H2O)

Kovats' RI, non-polar column, temperature ramp

Column type | Active phase | I | Reference | Comment |
---|---|---|---|---|
Packed | SE-30 | 1540. | Maurer, 1990 | N2, 100. C @ 3. min, 30. K/min, 310. C @ 5. min |

References

Maurer, 1990
Maurer, H.H.,
Identification and differentiation of barbiturates, other sedative-hypnotics and their metabolites in urine integrated in a general screening procedure using computerized gas chromatography-mass spectrometry,
J. Chromatogr., 1990, 530, 307-326, https://doi.org/10.1016/S0378-4347(00)82334-8
. [all data]