Nootkatone
- Formula: C15H22O
- Molecular weight: 218.3346
- IUPAC Standard InChIKey: WTOYNNBCKUYIKC-SLEUVZQESA-N
- CAS Registry Number: 4674-50-4
- Chemical structure:
View 3d structure (requires JavaScript / HTML 5) - Other names: 2(3H)-Naphthalenone, 4,4a,5,6,7,8-hexahydro-4,4a-dimethyl-6-(1-methylethenyl)-, [4R-(4α,4aα,6β)]-; (4R,4aS,6R)-4,4a-Dimethyl-6-(prop-1-en-2-yl)-4,4a,5,6,7,8-hexahydronaphthalen-2(3H)-one; 4βH,5α-Eremophila-1(10),11-dien-2-one; 4βH,5α-Eremorphila-1(10)11-dien-2-one; 4,4a,5,6,7,8-Hexahydro-4,4a-dimethyl-6-(1-methylethenyl)-2(3H)-naphthalenone, [4R-(4α,4aα,6β)]-; 6-Isopropenyl-4,4a-dimethyl-4,4a,5,6,7,8-hexahydro-2(3H)-naphthalenone-, [4R-(4α,4aα,6β)]-; (+)-5,6-dimethyl-8-isopropenylbicyclo[4.4.0]dec-1-en-3-one; 2(3H)-Naphthalenone, 4,4a,5,6,7,8-hexahydro-4,4a-dimethyl-6-(1-methylethenyl)-, (4R,4aS,6R)-; (+)-Nootkatone; Nootkanone; Nootkatane; [4R-(4α,4aα,6β)]-4,4a,5,6,7,8-hexahydro-4,4a-dimethyl-6-(1-methylvinyl)naphthalen-2(3H)-one

Kovats' RI, non-polar column, temperature ramp

Column type | Active phase | I | Reference | Comment |
---|---|---|---|---|
Capillary | DB-5 | 1807. | Adams, Morris, et al., 2005 | 30. m/0.26 mm/0.25 μm, He, 3. K/min; Tstart: 60. C; Tend: 246. C |
Capillary | SE-30 | 1765. | Kardali, Velasco-Negueruela, et al., 2000 | 25. m/0.22 mm/0.25 μm, He, 5. K/min; Tstart: 70. C; Tend: 220. C |

Van Den Dool and Kratz RI, non-polar column, temperature ramp

Column type | Active phase | I | Reference | Comment |
---|---|---|---|---|
Capillary | BP-1 | 1781. | Gonny, Cavaleiro, et al., 2006 | 50. m/0.22 mm/0.25 μm, He, 2. K/min, 220. C @ 20. min; Tstart: 60. C |
Capillary | Mega 5MS | 1780. | Verzera, Trozzi, et al., 2005 | 30. m/0.25 mm/0.25 μm, He, 40. C @ 2. min, 3. K/min; Tend: 240. C |
Capillary | ZB-5 | 1834. | Bell, 2004 | 30. m/0.32 mm/0.50 μm, Helium, 7. K/min, 265. C @ 5. min; Tstart: 40. C |
Capillary | DB-5 | 1823. | Bell, 2004 | 60. m/0.25 mm/0.25 μm, Helium, 7. K/min; Tstart: 40. C; Tend: 250. C |
Capillary | RTX-5 | 1798. | Dugo, Mondello, et al., 2004 | 30. m/0.25 mm/0.25 μm, He, 45. C @ 6. min, 3. K/min, 300. C @ 10. min |
Capillary | CP Sil 5 CB | 1819. | Martinez, Rosa, et al., 2004 | 30. m/0.25 mm/0.25 μm, N2, 5. K/min; Tstart: 50. C; Tend: 200. C |
Capillary | SPB-1 | 1763. | Chisholm, Jell, et al., 2003 | 30. m/0.25 mm/0.25 μm, He, 35. C @ 5. min, 4. K/min, 225. C @ 20. min |
Capillary | DB-5 | 1834. | Högnadóttir and Rouseff, 2003 | 30. m/0.32 mm/0.5 μm, 7. K/min, 265. C @ 5. min; Tstart: 40. C |
Capillary | DB-5 | 1833. | Högnadóttir and Rouseff, 2003 | 30. m/0.32 mm/0.5 μm, 7. K/min, 265. C @ 5. min; Tstart: 40. C |
Capillary | HP-5 | 1800. | Skaltsa, Demetzos, et al., 2003 | 30. m/0.25 mm/0.25 μm, He, 60. C @ 5. min, 4. K/min; Tend: 280. C |
Capillary | Mega 5MS | 1780. | Verzera, Trozzi, et al., 2003 | 30. m/0.25 mm/0.25 μm, He, 40. C @ 2. min, 3. K/min; Tend: 240. C |
Capillary | DB-1 | 1775. | Lin and Rouseff, 2001 | 30. m/0.32 mm/0.25 μm, 7. K/min, 240. C @ 5. min; Tstart: 40. C |
Capillary | Mega 5MS | 1780. | Verzera, la Rosa, et al., 2000 | 30. m/0.25 mm/0.25 μm, He, 40. C @ 2. min, 3. K/min; Tend: 240. C |
Capillary | Mega 5MS | 1780. | Verzera, Trozzi, et al., 2000 | 30. m/0.25 mm/0.25 μm, He, 40. C @ 2. min, 3. K/min; Tend: 240. C |
Capillary | DB-5 | 1803. | Nogueira, Marsaioli, et al., 1998 | 30. m/0.25 mm/0.25 μm, H2, 3. K/min; Tstart: 60. C; Tend: 240. C |
Capillary | OV-101 | 1775. | Yang, Sugisawa, et al., 1992 | N2, 2. K/min; Column length: 50. m; Column diameter: 0.25 mm; Tstart: 80. C; Tend: 200. C |
Capillary | OV-101 | 1780. | Yang, Sugisawa, et al., 1992 | N2, 2. K/min; Column length: 50. m; Column diameter: 0.25 mm; Tstart: 80. C; Tend: 200. C |

Van Den Dool and Kratz RI, non-polar column, custom temperature program

Column type | Active phase | I | Reference | Comment |
---|---|---|---|---|
Capillary | BPX-5 | 1837. | Dharmawan, Kasapis, et al., 2007 | 30. m/0.25 mm/0.25 μm, He; Program: 35C => 4C/min => 200C => 30C/min => 300C (3min) |
Capillary | ZB-5 | 1814. | Bell, 2004 | 30. m/0.32 mm/0.50 μm, Helium; Program: not specified |
Capillary | HP-5MS | 1820. | de Kraker, Schurink, et al., 2003 | 30. m/0.25 mm/0.25 μm, He; Program: not specified |
Capillary | SE-54 | 1814. | Buettner and Schieberle, 1999 | 30. m/0.32 mm/0.25 μm, He; Program: 35C (2min) => 40C/min => 50C (2min) => 6C/min => 180C => 10C/min => 230C (10min) |
Capillary | SE-54 | 1814. | Hinterholzer and Schieberie, 1998 | 30. m/0.32 mm/0.25 μm, He; Program: 35C(2min) => 40C/min => 50C(2min) => 6C/min => 180C => 10C/min => 230C(10min) |
Capillary | SE-52 | 1822. | Mondello, Dugo, et al., 1995 | 60. m/0.32 mm/0.40 μm, He; Program: 45 C (6 min) 3 C/min -> 111 0C 2 C/min -> 160 C 3 C/min -> 300 C (15 min) |

Van Den Dool and Kratz RI, polar column, temperature ramp

Column type | Active phase | I | Reference | Comment |
---|---|---|---|---|
Capillary | BP-20 | 2527. | Gonny, Cavaleiro, et al., 2006 | 50. m/0.22 mm/0.25 μm, He, 2. K/min, 220. C @ 20. min; Tstart: 60. C |
Capillary | DB-Wax | 2563. | Njoroge, Koaze, et al., 2005 | 60. m/0.25 mm/0.25 μm, N2, 70. C @ 2. min, 2. K/min, 230. C @ 20. min |
Capillary | Supelcowax-10 | 2539. | Martinez, Rosa, et al., 2004 | 30. m/0.25 mm/0.25 μm, N2, 5. K/min; Tstart: 50. C; Tend: 200. C |
Capillary | Innowax | 2563. | Chisholm, Jell, et al., 2003 | 15. m/0.25 mm/0.25 μm, He, 35. C @ 5. min, 4. K/min, 225. C @ 20. min |
Capillary | Carbowax 20M | 2506. | Mondello, Dugo, et al., 1995 | 60. m/0.32 mm/0.425 μm, He, 45. C @ 3. min, 3. K/min, 300. C @ 20. min |

Van Den Dool and Kratz RI, polar column, custom temperature program

Column type | Active phase | I | Reference | Comment |
---|---|---|---|---|
Capillary | FFAP | 2515. | Buettner and Schieberle, 1999 | 30. m/0.32 mm/0.25 μm, He; Program: 35C (2min) => 40C/min => 60C (2min) => 6C/min => 180C => 10C/min => 230C (10min) |

Normal alkane RI, non-polar column, temperature ramp

Column type | Active phase | I | Reference | Comment |
---|---|---|---|---|
Capillary | DB-5 | 1820. | Lawal and Oyedelji, 2009 | 30. m/0.25 mm/0.25 μm, Helium, 5. K/min; Tstart: 70. C; Tend: 240. C |
Capillary | HP-5 | 1820. | Bousaada, Ammar, et al., 2008 | 30. m/0.25 mm/0.25 μm, Nitrogen, 50. C @ 1. min, 5. K/min, 280. C @ 1. min |
Capillary | HP-5 MS | 1820. | Bouwmeester, de Kraker, et al., 2008 | 30. m/0.25 mm/0.25 μm, Helium, 70. C @ 1. min, 5. K/min, 210. C @ 5. min |
Capillary | DB-5 MS | 1802. | Noudogbessi, Yedomonhan, et al., 2008 | 30. m/0.25 mm/0.25 μm, Helium, 50. C @ 5. min, 5. K/min, 300. C @ 5. min |
Capillary | HP-5MS | 1799. | Ferhat, Meklati, et al., 2007 | 30. m/0.25 mm/0.25 μm, He, 60. C @ 8. min, 2. K/min, 250. C @ 15. min |
Capillary | HP-5MS | 1794. | Ferhat, Tigrine-Kordjani, et al., 2007 | 30. m/0.25 mm/0.25 μm, He, 60. C @ 8. min, 2. K/min, 250. C @ 15. min |
Capillary | DB-1 | 1774. | Lan Phi N.T., Nishiyama C., et al., 2006 | 60. m/0.25 mm/0.25 μm, 70. C @ 2. min, 2. K/min, 230. C @ 20. min |
Capillary | DB-1 | 1775. | Sawamura, Onishi, et al., 2006 | 60. m/0.25 mm/0.25 μm, 70. C @ 2. min, 2. K/min, 230. C @ 20. min |
Capillary | CP Sil 8 CB | 1799. | Suárez, Vásquez, et al., 2005 | He, 60. C @ 5. min, 3. K/min; Column length: 30. m; Column diameter: 0.25 mm; Tend: 290. C |
Capillary | RSL-200 | 1802. | Jirovetz, Buchbauer, et al., 2003 | 30. m/0.32 mm/0.25 μm, H2, 40. C @ 5. min, 6. K/min, 280. C @ 5. min |
Capillary | DB-5 | 1834. | Lin, Rouseff, et al., 2002 | 30. m/0.32 mm/0.25 μm, He, 7. K/min; Tstart: 40. C; Tend: 290. C |
Capillary | DB-5 | 1835. | Lin, Rouseff, et al., 2002 | 30. m/0.32 mm/0.25 μm, He, 7. K/min; Tstart: 40. C; Tend: 290. C |
Capillary | OV-101 | 1751. | Friedrich, Acree, et al., 2001 | 6. K/min; Column length: 15. m; Column diameter: 0.32 mm; Tstart: 35. C; Tend: 250. C |
Capillary | DB-5 | 1790. | Rouseff, Jella, et al., 2001 | 30. m/0.32 mm/0.5 μm, 6. K/min; Tstart: 35. C; Tend: 275. C |
Capillary | HP-5 | 1823. | Poiana, Sicari, et al., 1998 | 25. m/0.2 mm/0.33 μm, He, 70. C @ 8. min, 3. K/min, 290. C @ 20. min |
Capillary | DB-5 | 1798. | Tellez, Estell, et al., 1997 | 30. m/0.25 mm/0.25 μm, Helium, 3. K/min; Tstart: 60. C; Tend: 240. C |
Capillary | OV-101 | 1775. | Tamura, Yang, et al., 1993 | 2. K/min; Column length: 50. m; Column diameter: 0.25 mm; Tstart: 80. C; Tend: 200. C |
Capillary | OV-101 | 1780. | Tamura, Yang, et al., 1993 | 2. K/min; Column length: 50. m; Column diameter: 0.25 mm; Tstart: 80. C; Tend: 200. C |
Capillary | OV-101 | 1775. | Sugisawa, Yamamoto, et al., 1989 | N2, 2. K/min; Column length: 50. m; Column diameter: 0.25 mm; Tstart: 80. C; Tend: 200. C |

Normal alkane RI, non-polar column, custom temperature program

Column type | Active phase | I | Reference | Comment |
---|---|---|---|---|
Capillary | DB-5 MS | 1801. | Lima, Quintans-Junior, et al., 2011 | Helium; Column length: 30. m; Column diameter: 0.25 mm; Program: 50 0C (1.5 min) 4 0C/min -> 200 0C 10 0C/min -> 300 0C (10 min) |
Capillary | HP-5 MS | 1798. | Payo, Colo, et al., 2011 | Program: not specified |
Capillary | HP-5 MS | 1805. | Payo, Colo, et al., 2011 | Program: not specified |
Capillary | HP-5 MS | 1806. | Payo, Colo, et al., 2011 | Program: not specified |
Capillary | HP-5 MS | 1807. | Payo, Colo, et al., 2011 | Program: not specified |
Capillary | HP-5 MS | 1810. | Payo, Colo, et al., 2011 | Program: not specified |
Capillary | HP-5 MS | 1819. | Fan, Lu, et al., 2009 | 30. m/0.25 mm/0.25 μm, Helium; Program: 40 0C (3 min) 3 0C/min -> 160 0C (2 min) 8 0C/min -> 220 0C (3 min) |
Capillary | SPB-5 | 1800. | Kilani, Ledauphin, et al., 2008 | Program: not specified |
Capillary | HP-5 | 1812. | Qiao, Xie, et al., 2008 | 30. m/0.25 mm/0.25 μm, Helium; Program: 40 0C (3 min) 3 0C/min -> 160 0C (2 min) 8 0C/min -> 220 0C (3 min) |
Capillary | HP-5 | 1833. | Qiao, Xie, et al., 2008 | 30. m/0.25 mm/0.25 μm, Helium; Program: not specified |
Capillary | DB-5 | 1816. | Massardo, Senatore, et al., 2006 | 30. m/0.25 mm/0.25 μm, He; Program: 40C (5min) => 2C/min => 250C(15min) => 5C/min => 270C (10min) |
Capillary | SE-30 | 1797. | Vinogradov, 2004 | Program: not specified |
Capillary | CP Sil 5 CB | 1781. | Weyerstahl, Marschall, et al., 2000 | Column length: 25. m; Program: not specified |
Capillary | SF-96 | 1795. | Kawasaki, Matsui, et al., 1998 | Column length: 40. m; Column diameter: 0.28 mm; Program: 75C => 3C/min => 190C(25min) => 3C/min => 210C |
Capillary | Polydimethyl siloxanes | 1797. | Zenkevich, 1997 | Program: not specified |
Capillary | OV-101 | 1802. | Shibamoto, 1987 | Program: not specified |

Normal alkane RI, polar column, temperature ramp

Column type | Active phase | I | Reference | Comment |
---|---|---|---|---|
Capillary | DB-Wax | 2525. | Lan Phi N.T., Nishiyama C., et al., 2006 | 60. m/0.25 mm/0.25 μm, 70. C @ 2. min, 2. K/min, 230. C @ 20. min |
Capillary | DB-Wax | 2526. | Lan Phi N.T., Nishiyama C., et al., 2006 | 60. m/0.25 mm/0.25 μm, 70. C @ 2. min, 2. K/min, 230. C @ 20. min |
Capillary | DB-Wax | 2532. | Sawamura, Onishi, et al., 2006 | 60. m/0.25 mm/0.25 μm, 70. C @ 2. min, 2. K/min, 230. C @ 20. min |
Capillary | DB-Wax | 2563. | Njoroge, Koaze, et al., 2005, 2 | 60. m/0.25 mm/0.25 μm, N2, 70. C @ 2. min, 2. K/min, 230. C @ 20. min |
Capillary | DB-Wax | 2563. | Njoroge, Koaze, et al., 2005, 3 | 60. m/0.25 mm/0.25 μm, N2, 70. C @ 2. min, 2. K/min, 230. C @ 20. min |
Capillary | DB-Wax | 2544. | Tu, Thanh, et al., 2002 | 60. m/0.25 mm/0.25 μm, N2, 2. K/min; Tstart: 70. C; Tend: 230. C |
Capillary | DB-Wax | 2504. | Umano, Hagi, et al., 2002 | 60. m/0.25 mm/0.25 μm, He, 40. C @ 2. min, 2. K/min; Tend: 200. C |

Normal alkane RI, polar column, custom temperature program

Column type | Active phase | I | Reference | Comment |
---|---|---|---|---|
Capillary | DB-Wax | 2522. | Selli, 2007 | 30. m/0.32 mm/0.50 μm, Hydrogen; Program: 60 0C (3 min) 2 0C/min -> 220 0C 3 0C/min -> 245 0C (20 min) |
Capillary | HP-Innowax FSC | 2554. | Sezik E., Kocakulak E., et al., 2005 | 60. m/0.25 mm/0.25 μm, He; Program: 60C(10min) => 4C/min => 220C(10min) => 1C/min => 240C |
Capillary | DB-Wax | 2515. | Selli, Cabaroglu, et al., 2003 | 30. m/0.32 mm/0.5 μm, He; Program: 60C(2min) => 2C/min => 220C => 3C/min => 245C(20min) |

References

Adams, Morris, et al., 2005
Adams, R.P.; Morris, J.A.; Pandey, R.N.; Schwarzbach, A.E.,
Cryptic speciation between Juniperus deltoides and Juniperus oxycedrus (Cupressaceae) in the Mediterranean,
Biochem. Syst. Ecol., 2005, 33, 8, 771-787, https://doi.org/10.1016/j.bse.2005.01.001
. [all data]
Kardali, Velasco-Negueruela, et al., 2000
Kardali, M.; Velasco-Negueruela, A.; Pérez-Alonso, M.,
Essential Oil Constituents of Sideritis ibanyezii Pau,
Botanica Complutensis, 2000, 24, 101-106. [all data]
Gonny, Cavaleiro, et al., 2006
Gonny, M.; Cavaleiro, C.; Salgueiro, L.; Casanova, J.,
Analysis of Juniperus communis subsp. alpina needle, berry, wood and root oils by combination of GC, GC/MS and 13C-NMR,
Flavour Fragr. J., 2006, 21, 1, 99-106, https://doi.org/10.1002/ffj.1527
. [all data]
Verzera, Trozzi, et al., 2005
Verzera, A.; Trozzi, A.; Zappala, M.; Condurso, C.; Cotroneo, A.,
Essential Oil Composition of Citrus meyerii Y. Tan. and Citrus medica L. cv. Diamante and Their Lemon Hybrids,
J. Agric. Food Chem., 2005, 53, 12, 4890-4894, https://doi.org/10.1021/jf047879c
. [all data]
Bell, 2004
Bell, W.A.-M.,
Examination of Aroma Volatiles Formed from Thermal Processing of Florida Reconstituted Grapefruit Juice. A Thesis presented to the graduate school of the university of Florida in partial fulfillment of the requirements for the degree of master of science, 2004. [all data]
Dugo, Mondello, et al., 2004
Dugo, P.; Mondello, L.; Zappia, G.; Bonaccorsi, I.; Cotroneo, A.; Russo, M.T.,
The composition of the volatile fraction and the enantiomeric distribution of five volatile components of faustrime oil (Monocitrus australatica x Fortunella sp. x Citrus aurantifolia),
J. Essent. Oil Res., 2004, 16, 4, 328-333, https://doi.org/10.1080/10412905.2004.9698734
. [all data]
Martinez, Rosa, et al., 2004
Martinez, J.; Rosa, P.T.V.; Menut, C.; Leydet, A.; Brat, P.; Pallet, D.; Meireles, M.A.A.,
Valorization of Brazilian vetiver (Vetiveria zizanioides (L.) Nash ex Small) oil,
J. Agric. Food Chem., 2004, 52, 21, 6578-6584, https://doi.org/10.1021/jf049182x
. [all data]
Chisholm, Jell, et al., 2003
Chisholm, M.G.; Jell, J.A.; Cass, D.M., Jr.,
Characterization of the major odorants found in the peel oil of Citrus reticulata Blanco cv. Clementine using gas chromatography-olfactometry,
Flavour Fragr. J., 2003, 18, 4, 275-281, https://doi.org/10.1002/ffj.1188
. [all data]
Högnadóttir and Rouseff, 2003
Högnadóttir, Á.; Rouseff, R.L.,
Identification of aroma active compounds in organce essence oil using gas chromatography-olfactometry and gas chromatography-mass spectrometry,
J. Chromatogr. A, 2003, 998, 1-2, 201-211, https://doi.org/10.1016/S0021-9673(03)00524-7
. [all data]
Skaltsa, Demetzos, et al., 2003
Skaltsa, H.D.; Demetzos, C.; Lazari, D.; Sokovic, M.,
Essential oil analysis and antimicrobial activity of eight Stachys species from Greece,
Phytochemistry, 2003, 64, 3, 743-752, https://doi.org/10.1016/S0031-9422(03)00386-8
. [all data]
Verzera, Trozzi, et al., 2003
Verzera, A.; Trozzi, A.; Gazea, F.; Cicciarelloi, G.; Cotroneo, A.,
Effects of rootstock on the composition of bergamot (Citrus bergamia Risso et Poiteau) essential oil,
J. Agric. Food Chem., 2003, 51, 1, 206-210, https://doi.org/10.1021/jf0206872
. [all data]
Lin and Rouseff, 2001
Lin, J.; Rouseff, R.L.,
Characterization of aroma-impact compounds in cold-pressed grapefruit oil using time-intensity GC-olfactometry and GC-MS,
Flavour Fragr. J., 2001, 16, 6, 457-463, https://doi.org/10.1002/ffj.1041
. [all data]
Verzera, la Rosa, et al., 2000
Verzera, A.; la Rosa, G.; Zappalà, M.; Cotroneo, A.,
Essential oil composition of different cultivars of bergamot grown in Sicily,
Ital. J. Food Sci., 2000, 12, 4, 493-501. [all data]
Verzera, Trozzi, et al., 2000
Verzera, A.; Trozzi, A.; Cotroneo, A.; Lorenzo, D.; Dellacassa, E.,
Uruguayan essential oil. 12. Composition of Nova and Satsuma mandarin oils,
J. Agric. Food Chem., 2000, 48, 7, 2903-2909, https://doi.org/10.1021/jf990734z
. [all data]
Nogueira, Marsaioli, et al., 1998
Nogueira, P.C.L.; Marsaioli, A.J.; Amaral, M.C.E.; Bittrich, V.,
The fragrant floral oils of Tovomita species,
Phytochemistry, 1998, 49, 4, 1009-1012, https://doi.org/10.1016/S0031-9422(97)01046-7
. [all data]
Yang, Sugisawa, et al., 1992
Yang, R.; Sugisawa, H.; Nakatani, H.; Tamura, H.; Takagi, N.,
Comparison of odor quality in peel oils of acid citrus,
Nippon Shokuhin Kogyo Gakkaishi, 1992, 39, 1, 16-24, https://doi.org/10.3136/nskkk1962.39.16
. [all data]
Dharmawan, Kasapis, et al., 2007
Dharmawan, J.; Kasapis, S.; Curran, P.; Johnson, J.R.,
Characterization of volatile compounds in selected citrus fruits from Asia. Part I: freshly-squeezed juice,
Flavour Fragr. J., 2007, 22, 3, 228-232, https://doi.org/10.1002/ffj.1790
. [all data]
de Kraker, Schurink, et al., 2003
de Kraker, J.-W.; Schurink, M.; Franssen, M.C.R.; König, W.A.; de Groot, A.; Bouwmeester, H.J.,
Hydroxylation of sesquiterpenes by enzymes from chicory (Cichorium intybus L.) roots,
Tetrahedron, 2003, 59, 3, 409-418, https://doi.org/10.1016/S0040-4020(02)01479-5
. [all data]
Buettner and Schieberle, 1999
Buettner, A.; Schieberle, P.,
Characterization of the most odor-active volatiles in fresh, hand squeezed juice of grapefruit (Citrus paradise Macfayden),
J. Agric. Food Chem., 1999, 47, 12, 5189-5193, https://doi.org/10.1021/jf990071l
. [all data]
Hinterholzer and Schieberie, 1998
Hinterholzer, A.; Schieberie, P.,
Identification of the most odour-active volatiles in fresh, hand-extracted juice of valencia late oranges by odour dilution techniques,
Flavour Fragr. J., 1998, 13, 1, 49-55, https://doi.org/10.1002/(SICI)1099-1026(199801/02)13:1<49::AID-FFJ691>3.0.CO;2-S
. [all data]
Mondello, Dugo, et al., 1995
Mondello, L.; Dugo, P.; Basile, A.; Dugo, G.,
Interactive use of linear retention indices, on polar and apolar columns, with a MS-library for reliable identification of complex mixtures,
J. Microcolumn Sep., 1995, 7, 6, 581-591, https://doi.org/10.1002/mcs.1220070605
. [all data]
Njoroge, Koaze, et al., 2005
Njoroge, S.M.; Koaze, H.; Karanja, P.N.; Sawamura, M.,
Volatile Constituents of Redblush Grapefruit ( Citrus paradisi) and Pummelo ( Citrus grandis) Peel Essential Oils from Kenya,
J. Agric. Food Chem., 2005, 53, 25, 9790-9794, https://doi.org/10.1021/jf051373s
. [all data]
Lawal and Oyedelji, 2009
Lawal, O.A.; Oyedelji, A.O.,
Chemical composition of the essential oils of Cyperus rotundus L. from South Africa,
Molecules, 2009, 14, 8, 2909-2917, https://doi.org/10.3390/molecules14082909
. [all data]
Bousaada, Ammar, et al., 2008
Bousaada, O.; Ammar, S.; Saidana, D.; Chriaa, J.; Chraif, I.; Daami, M.; Helal, A.N.; Mighri, Z.,
Chemical composition and antimicrobial activity of volatile components from capitula and aerial parts of Rhaponticum acaule DC growing wild in Tunisia,
Microbiol. Res., 2008, 163, 1, 87-95, https://doi.org/10.1016/j.micres.2007.02.010
. [all data]
Bouwmeester, de Kraker, et al., 2008
Bouwmeester, H.J.; de Kraker, J.-W.; Schurink, M.; Bino, R.J.; de Groot, A.,
Plant Enzymes for Bioconversion, 2008, 57. [all data]
Noudogbessi, Yedomonhan, et al., 2008
Noudogbessi, J.-P.; Yedomonhan, P.; Sohounhloue, D.C.K.; Chalchat, J.-C.; Figueredo, G.,
Chemical composition of essential oil of syzygium guineense (Willd.) DC. var. guineense (Myrtaceae) from Benin,
Rec. Nat. Prod., 2008, 33-38. [all data]
Ferhat, Meklati, et al., 2007
Ferhat, M.A.; Meklati, B.Y.; Chemat, F.,
Comparison of different isolation methods of essential oil from Citrus fruits: cold pressing, hydrodistillation and microwave dry distillation,
Flavour Fragr. J., 2007, 22, 6, 494-504, https://doi.org/10.1002/ffj.1829
. [all data]
Ferhat, Tigrine-Kordjani, et al., 2007
Ferhat, M.A.; Tigrine-Kordjani, N.; Chemat, S.; Meklati, B.Y.; Chemat, F.,
Rapid Extraction of Volatile Compounds Using a New Simultaneous Microwave Distillation: Solvent Extraction Device,
Chromatographia, 2007, 65, 3-4, 217-222, https://doi.org/10.1365/s10337-006-0130-5
. [all data]
Lan Phi N.T., Nishiyama C., et al., 2006
Lan Phi N.T.; Nishiyama C.; Choi H.-S.; Sawamura M.,
Evaluation of aroma characteristic compounds of Citrus natsudaidai Hayata (Natsudaidai) cold-pressed peel oil,
Biosci. Biotechnol. Biochem., 2006, 70, 8, 1832-1838, https://doi.org/10.1271/bbb.50705
. [all data]
Sawamura, Onishi, et al., 2006
Sawamura, M.; Onishi, Y.; Ikemoto, J.; Tu, N.T.M.; Phi, N.T.L.,
Characteristic odour components of bergamot (Citrus bergamia Risso) essential oil,
Flavour Fragr. J., 2006, 21, 4, 609-615, https://doi.org/10.1002/ffj.1604
. [all data]
Suárez, Vásquez, et al., 2005
Suárez, A.I.; Vásquez, L.J.; Manzano, M.A.; Compagnone, R.S.,
Essential oil composition of Croton cuneatus and Croton malambo growing in Venezuela,
Flavour Fragr. J., 2005, 20, 6, 611-614, https://doi.org/10.1002/ffj.1498
. [all data]
Jirovetz, Buchbauer, et al., 2003
Jirovetz, L.; Buchbauer, G.; Shafi, M.P.; Leela, N.K.,
Analysis of the essential oils of the leaves, stems, rhizomes and roots of the medicinal plant Alpinia galanga from southern India,
Acta Pharm. Hung., 2003, 53, 73-81. [all data]
Lin, Rouseff, et al., 2002
Lin, J.; Rouseff, R.L.; Barros, S.; Naim, M.,
Aroma composition changes in early season grapefruit juice produced from thermal concentration,
J. Agric. Food Chem., 2002, 50, 4, 813-819, https://doi.org/10.1021/jf011154g
. [all data]
Friedrich, Acree, et al., 2001
Friedrich, J.E.; Acree, T.E.; Lavin, E.H.,
Selecting standards for gas chromatography - olfactometry,
Am. Chem. Soc. Symp. Ser., 2001, 782, 148-155. [all data]
Rouseff, Jella, et al., 2001
Rouseff, R.; Jella, P.; Bazemore, R.; Yang, J.-J.,
Aroma active internal standards for gas chromatography-olfactometry of grapefruit juices,
Am. Chem. Soc. Symp. Ser., 2001, 782, 73-87. [all data]
Poiana, Sicari, et al., 1998
Poiana, M.; Sicari, V.; Mincione, B.,
Supercritical carbon dioxide (SC-CO2) extraction of grapefruit flavedo,
Flavour Fragr. J., 1998, 13, 2, 125-130, https://doi.org/10.1002/(SICI)1099-1026(199803/04)13:2<125::AID-FFJ708>3.0.CO;2-#
. [all data]
Tellez, Estell, et al., 1997
Tellez, M.R.; Estell, R.E.; Frederickson, E.L.; Havstad, K.M.,
Essntial oil of Flourensia cernua DC,
J. Essent. Oil Res., 1997, 9, 6, 619-624, https://doi.org/10.1080/10412905.1997.9700799
. [all data]
Tamura, Yang, et al., 1993
Tamura, H.; Yang, R.-H.; Sugisawa, H.,
Aroma profiles of peel oils of acid citrus,
ACS Sym. Ser., 1993, 525, 121-136. [all data]
Sugisawa, Yamamoto, et al., 1989
Sugisawa, H.; Yamamoto, M.; Tamura, H.; Takagi, N.,
The comparison of volatile components in peel oil from four species of navel orange,
Nippon Shokuhin Kogio Gakkaishi, 1989, 36, 6, 455-462, https://doi.org/10.3136/nskkk1962.36.6_455
. [all data]
Lima, Quintans-Junior, et al., 2011
Lima, G.M.; Quintans-Junior, L.J.; Thomazzi, S.M.; Almeida, E.M.S.A.; Melo, M.S.; Serafini, M.R.; Cavalcanti, S.C.H.; Gelain, D.P.; Santos, J.P.A.; Blank, A.F.; Alves, P.B.; Neta, P.M.O.; Lima, J.T.; Rocha, R.F.; Moreira, J.C.F.; Araujo, A.A.S.,
Phytochemical screening, antinociceptive and anti-inflammatory activities of Chrysopogon zizanioides essential oil,
Braz. J. Pharmacognosy, 2011, 1-8. [all data]
Payo, Colo, et al., 2011
Payo, D.A.; Colo, J.; Calumpong, H.; de Clerck, O.,
Variability of non-polar secondary metabolites in the Red Alga Portieria,
Mar Drugs, 2011, 9, 11, 2438-2468, https://doi.org/10.3390/md9112438
. [all data]
Fan, Lu, et al., 2009
Fan, G.; Lu, W.; Yao, X.; Zhang, Y.; Wang, K.; Pan, S.,
effect of fermentation on free and bound volatile compounds of orange juice,
Flavour Fragr. J., 2009, 24, 5, 219-229, https://doi.org/10.1002/ffj.1931
. [all data]
Kilani, Ledauphin, et al., 2008
Kilani, S.; Ledauphin, J.; Bouhlel, I.; Ben Sghaier, M.; Boubaker, J.; Skandrani, I.; Mosrati, R.; Ghedira, K.; Barillier, D.; Chekir-Ghedira, L.,
Comparative study of Cyperus rotundus essential oil by a modified GC/MS analysis method. Evaluation of its antioxidantt, cytotoxic, and apoptoic effects,
Chem. Biodiversity, 2008, 5, 5, 729-742, https://doi.org/10.1002/cbdv.200890069
. [all data]
Qiao, Xie, et al., 2008
Qiao, Y.; Xie, B.J.; Zhang, Y.; Zhang, Y.; FAn, G.; Yao, X.L.; Pan, S.Y.,
Characterization of aroma active compounds in fruit juice and peel oil of Junchen sweet orange fruit (Citrus sinensis (L.) Osbeck) by GC-MS and GC-O,
Molecules, 2008, 13, 6, 1333-1344, https://doi.org/10.3390/molecules13061333
. [all data]
Massardo, Senatore, et al., 2006
Massardo, D.R.; Senatore, F.; Alifano, P.; del Giudice, L.; Pontieri, P.,
Vetiver oil production correlates with early root growth,
Biochem. Syst. Ecol., 2006, 34, 5, 376-382, https://doi.org/10.1016/j.bse.2005.10.016
. [all data]
Vinogradov, 2004
Vinogradov, B.A.,
Production, composition, properties and application of essential oils, 2004, retrieved from http://viness.narod.ru. [all data]
Weyerstahl, Marschall, et al., 2000
Weyerstahl, P.; Marschall, H.; Splittgerber, U.; Wolf, D.; Surburg, H.,
Constituents of Haitian vetiver oil,
Flavour Fragr. J., 2000, 15, 6, 395-412, https://doi.org/10.1002/1099-1026(200011/12)15:6<395::AID-FFJ930>3.0.CO;2-9
. [all data]
Kawasaki, Matsui, et al., 1998
Kawasaki, W.; Matsui, K.; Akakabe, Y.; Itai, N.; Kajiwara, T.,
Long-chain aldehyde-forming activity in tobacco leaves,
Phytochemistry, 1998, 49, 6, 1565-1568, https://doi.org/10.1016/S0031-9422(98)00236-2
. [all data]
Zenkevich, 1997
Zenkevich, I.G.,
Analytical Parameters of Components of Essential Oils for their Chromatographic and Chromato-Spectral Identificaiton. Oxsigenated derivatives of Mono- and Sesquiterpene Hydrocarbons,
Rastit, Resursy (Rus.), 1997, 33, 1, 16-28. [all data]
Shibamoto, 1987
Shibamoto, T.,
Retention Indices in Essential Oil Analysis
in Capillary Gas Chromatography in Essential Oil Analysis, Sandra, P.; Bicchi, C., ed(s)., Hutchig Verlag, Heidelberg, New York, 1987, 259-274. [all data]
Njoroge, Koaze, et al., 2005, 2
Njoroge, S.M.; Koaze, H.; Mwaniki, M.; Minh Tu, N.T.; Sawamura, M.,
Essential oils of Kenyan Citrus fruits: volatile components of two varieties of mandarins (Citrus reticulata) and a tangelo (C. paradisi × C. tangerina),
Flavour Fragr. J., 2005, 20, 1, 74-79, https://doi.org/10.1002/ffj.1376
. [all data]
Njoroge, Koaze, et al., 2005, 3
Njoroge, S.M.; Koaze, H.; Karanja, P.N.; Sawamura, M.,
Essential oil constituents of three varieties of Kenyan sweet oranges (Citrus sinensis),
Flavour Fragr. J., 2005, 20, 1, 80-85, https://doi.org/10.1002/ffj.1377
. [all data]
Tu, Thanh, et al., 2002
Tu, N.T.M.; Thanh, L.X.; Une, A.; Ukeda, H.; Sawamura, M.,
Volatile constituents of Vietnamese pummelo, orange, tangerine and lime peel oils,
Flavour Fragr. J., 2002, 17, 3, 169-174, https://doi.org/10.1002/ffj.1076
. [all data]
Umano, Hagi, et al., 2002
Umano, K.; Hagi, Y.; Shibamoto, T.,
Volatile chemicals identified in extracts from newly hybrid citrus, dekopon (Shiranuhi mandarin Suppl. J.),
J. Agric. Food Chem., 2002, 50, 19, 5355-5359, https://doi.org/10.1021/jf0203951
. [all data]
Selli, 2007
Selli, S.,
Volatile constituents of orange obtained from moro oranges (Citrus Sinensis L. Osbeck),
J. Food Quality, 2007, 30, 3, 330-341, https://doi.org/10.1111/j.1745-4557.2007.00124.x
. [all data]
Sezik E., Kocakulak E., et al., 2005
Sezik E.; Kocakulak E.; Baser K.H.C.; Ozek T.,
Composition of the essential oils of Juniperus oxycedrus subsp macrocarpa from Turkey,
Chem. Nat. Compd. (Engl. Transl.), 2005, 41, 3, 352-354, https://doi.org/10.1007/s10600-005-0149-0
. [all data]
Selli, Cabaroglu, et al., 2003
Selli, s.; Cabaroglu, T.; Canbas, A.,
Flavour components of orange wine made from a Turkish cv. Kozan,
Int. J. Food Sci. Technol., 2003, 38, 5, 587-593, https://doi.org/10.1046/j.1365-2621.2003.00691.x
. [all data]