Pyridine, 3-propyl-
- Formula: C8H11N
- Molecular weight: 121.1796
- IUPAC Standard InChIKey: MLAXEZHEGARMPE-UHFFFAOYSA-N
- CAS Registry Number: 4673-31-8
- Chemical structure:
View 3d structure (requires JavaScript / HTML 5) - Other names: 3-Propylpyridine; 1-(3-Pyridyl)propane; 3-(n-Propyl)pyridine; Pyridine, 5-propyl

Phase change data

Data compiled by: William E. Acree, Jr., James S. Chickos
Enthalpy of vaporization
ΔvapH (kJ/mol) | Temperature (K) | Method | Reference | Comment |
---|---|---|---|---|
49.9 | 365. | A | Stephenson and Malanowski, 1987 | Based on data from 350. to 450. K. |

Kovats' RI, non-polar column, isothermal

Column type | Active phase | Temperature (C) | I | Reference | Comment |
---|---|---|---|---|---|
Capillary | OV-1 | 70. | 1038. | Nabivach, 1989 |

Normal alkane RI, non-polar column, temperature ramp

Column type | Active phase | I | Reference | Comment |
---|---|---|---|---|
Capillary | DB-1 | 1018. | Ishihara, Tsuneya, et al., 1992 | 60. m/0.25 mm/0.25 μm, He, 50. C @ 5. min, 3. K/min; Tend: 240. C |
Capillary | DB-1 | 1019. | Ishihara, Tsuneya, et al., 1992 | 60. m/0.25 mm/0.25 μm, He, 50. C @ 5. min, 3. K/min; Tend: 240. C |
Capillary | SPB-1 | 1034. | Thomas and Bassols, 1992 | 5. K/min; Column length: 60. m; Tstart: 80. C; Tend: 230. C |

Normal alkane RI, polar column, temperature ramp

Column type | Active phase | I | Reference | Comment |
---|---|---|---|---|
Capillary | Supelcowax | 1494. | Thomas and Bassols, 1992 | 5. K/min; Column length: 60. m; Tstart: 80. C; Tend: 230. C |

Normal alkane RI, polar column, custom temperature program

Column type | Active phase | I | Reference | Comment |
---|---|---|---|---|
Capillary | Carbowax | 1457. | Baltes and Bochmann, 1987 | Program: not specified |
Capillary | Carbowax | 1460. | Baltes and Bochmann, 1987 | Program: not specified |
Capillary | Carbowax | 1461. | Baltes and Bochmann, 1987 | Program: not specified |
Capillary | Carbowax | 1462. | Baltes and Bochmann, 1987 | Program: not specified |
Capillary | Carbowax | 1463. | Baltes and Bochmann, 1987 | Program: not specified |

References

Stephenson and Malanowski, 1987
Stephenson, Richard M.; Malanowski, Stanislaw,
Handbook of the Thermodynamics of Organic Compounds, 1987, https://doi.org/10.1007/978-94-009-3173-2
. [all data]
Nabivach, 1989
Nabivach, V.M.,
Calculation of gas chromatographic retention indices for alkylpyridines from their structural characteristics,
Zh. Anal. Khim., 1989, 44, 9, 1615-1621. [all data]
Ishihara, Tsuneya, et al., 1992
Ishihara, M.; Tsuneya, T.; Shiga, M.; Kawashima, S.; Yamagishi, K.; Yoshida, F.; Sato, H.; Uneyama, K.,
New pyridine derivatives and basic components in spearmint oil (Mentha gentilis f. cardiaca) and peppermint oil (Mentha piperita),
J. Agric. Food Chem., 1992, 40, 9, 1647-1655, https://doi.org/10.1021/jf00021a034
. [all data]
Thomas and Bassols, 1992
Thomas, A.F.; Bassols, F.,
Occurrence of pyridines and other bases in orange oil,
J. Agric. Food Chem., 1992, 40, 11, 2236-2243, https://doi.org/10.1021/jf00023a037
. [all data]
Baltes and Bochmann, 1987
Baltes, W.; Bochmann, G.,
Model reactions on roast aroma formations, V. Mass spectrometric identification of pyrifines, oxazoles, and carbocyclic compounds from the reaction of serine and threonine with sucrose under the conditions of coffee roasting,
Z. Lebensm. Unters. Forsch., 1987, 185, 1, 5-9, https://doi.org/10.1007/BF01083331
. [all data]