14-methylpentadecanoic acid
- Formula: C16H32O2
- Molecular weight: 256.4241
- IUPAC Standard InChIKey: ZONJATNKKGGVSU-UHFFFAOYSA-N
- CAS Registry Number: 4669-02-7
- Chemical structure:
View 3d structure (requires JavaScript / HTML 5) - Permanent link for this species. Use this link for bookmarking this species for future reference.

Phase change data

Data compiled by: Thermodynamics Research Center, NIST Boulder Laboratories, Chris Muzny director
Quantity | Value | Units | Method | Reference | Comment |
---|---|---|---|---|---|
Tfus | 335. | K | N/A | Liu, 1952 | Uncertainty assigned by TRC = 1.5 K |

Van Den Dool and Kratz RI, polar column, temperature ramp

Column type | Active phase | I | Reference | Comment |
---|---|---|---|---|
Capillary | DB-Wax | 2861. | Shiratsuchi, Shimoda, et al., 1994 | 60. m/0.25 mm/0.25 μm, He, 2. K/min, 230. C @ 60. min; Tstart: 50. C |

References

Liu, 1952
Liu, S.-L.,
Fatty Acids from Lanolin, Essays and Papers in Memory of Late President Fu Ssu-Nien 199-213 1952, 1952. [all data]
Shiratsuchi, Shimoda, et al., 1994
Shiratsuchi, H.; Shimoda, M.; Imayoshi, K.; Noda, K.; Osajima, Y.,
Volatile flavor compounds in spray-dried skim milk powder,
J. Agric. Food Chem., 1994, 42, 4, 984-988, https://doi.org/10.1021/jf00040a028
. [all data]