Cyclopropane, 1-propenyl-
- Formula: C6H10
- Molecular weight: 82.1436
- IUPAC Standard InChIKey: TWAJIXJFYMNJJO-NSCUHMNNSA-N
- CAS Registry Number: 4663-21-2
- Chemical structure:
View 3d structure (requires JavaScript / HTML 5) - Species with the same structure:
- Stereoisomers:
- Other names: Propene, 1-cyclopropyl-; Cyclopropane, propenyl-; 1-Propene, 1-cyclopropyl-

Normal alkane RI, non-polar column, custom temperature program

Column type | Active phase | I | Reference | Comment |
---|---|---|---|---|
Capillary | Squalane | 684. | Chen, 2008 | Program: not specified |

References

Chen, 2008
Chen, H.-F.,
Quantitative prediction of gas chromatography retention indices with support vector machines, radial basis neutral networks and multiple linear regression,
Anal. Chim. Acta, 2008, 609, 1, 24-36, https://doi.org/10.1016/j.aca.2008.01.003
. [all data]