(Dl)-2-amino-2-methyl-butanoic acid
- Formula: C5H11NO2
- Molecular weight: 117.1463
- IUPAC Standard InChIKey: GCHPUFAZSONQIV-UHFFFAOYSA-N
- CAS Registry Number: 465-58-7
- Chemical structure:
View 3d structure (requires JavaScript / HTML 5) - Stereoisomers:

Phase change data

Data compiled by: William E. Acree, Jr., James S. Chickos
Enthalpy of sublimation
ΔsubH (kJ/mol) | Temperature (K) | Method | Reference | Comment |
---|---|---|---|---|
134. ± 1. | 413. | TE,ME | de Kruif, Voogd, et al., 1979 | |
125.8 ± 0.4 | 454. | N/A | Svec and Clyde, 1965 | Based on data from 439. to 469. K. See also Clyde and Svec, 1964. |

References

de Kruif, Voogd, et al., 1979
de Kruif, C.G.; Voogd, J.; Offringa, J.C.A.,
Enthalpies of sublimation and vapour pressures of 14 amino acids and peptides,
The Journal of Chemical Thermodynamics, 1979, 11, 7, 651-656, https://doi.org/10.1016/0021-9614(79)90030-2
. [all data]
Svec and Clyde, 1965
Svec, H.J.; Clyde, D.D.,
Vapor Pressures of Some α-Amino Acids.,
J. Chem. Eng. Data, 1965, 10, 2, 151-152, https://doi.org/10.1021/je60025a024
. [all data]
Clyde and Svec, 1964
Clyde, D.D.; Svec, H.,
, U. S. Atomic Energy Comm. IS-790, 1964, 1. [all data]