Benzeneethanol, 4-bromo-
- Formula: C8H9BrO
- Molecular weight: 201.060
- IUPAC Standard InChIKey: PMOSJSPFNDUAFY-UHFFFAOYSA-N
- CAS Registry Number: 4654-39-1
- Chemical structure:
View 3d structure (requires JavaScript / HTML 5) - Other names: Phenethyl alcohol, p-bromo-; 4-Bromo-phenethyl alcohol; 2-(4-Bromophenyl)ethanol; p-Bromophenethyl alcohol

Phase change data

Data compiled by: Robert L. Brown and Stephen E. Stein
Reduced pressure boiling point
Tboil (K) | Pressure (bar) | Reference |
---|---|---|
411.2 | 0.01 | Weast and Grasselli, 1989 |

References

Weast and Grasselli, 1989
CRC Handbook of Data on Organic Compounds, 2nd Editon, Weast,R.C and Grasselli, J.G., ed(s)., CRC Press, Inc., Boca Raton, FL, 1989, 1. [all data]