Bicyclo[2.2.1]heptan-2-one, 1,7,7-trimethyl-, (1S)-
- Formula: C10H16O
- Molecular weight: 152.2334
- IUPAC Standard InChIKey: DSSYKIVIOFKYAU-UHFFFAOYSA-N
- CAS Registry Number: 464-48-2
- Chemical structure:
View 3d structure (requires JavaScript / HTML 5) - Species with the same structure:
- Stereoisomers:
- Other names: (-)-Alcanfor; (-)-Camphor; Camphor, (1S,4S)-(-)-; L-camphor; Levo-(-)-camphor; (1S)-(-)-Camphor; Camphor, l-, (-)-; 1,7,7-Trimethylbicyclo[2.2.1]heptan-2-one, (1S,4S)-; S-(-)-Camphor; Camphore; (-)-bornan-2-one

Phase change data

Data compiled as indicated in comments:
BS - Robert L. Brown and Stephen E. Stein
TRC - Thermodynamics Research Center, NIST Boulder Laboratories, Chris Muzny director
Quantity | Value | Units | Method | Reference | Comment |
---|---|---|---|---|---|
Tboil | 477.2 | K | N/A | Aldrich Chemical Company Inc., 1990 | BS |
Quantity | Value | Units | Method | Reference | Comment |
Tfus | 453.2 | K | N/A | White and Bishop, 1940 | Uncertainty assigned by TRC = 1.5 K; TRC |

Van Den Dool and Kratz RI, non-polar column, custom temperature program

Column type | Active phase | I | Reference | Comment |
---|---|---|---|---|
Capillary | DB-5 | 1139. | Özel, Gögüs, et al., 2006 | Program: not specified |

Van Den Dool and Kratz RI, polar column, temperature ramp

Column type | Active phase | I | Reference | Comment |
---|---|---|---|---|
Capillary | CP-Wax 52CB | 1507. | Kjeldsen, Christensen, et al., 2003 | 50. m/0.25 mm/0.2 μm, He, 32. C @ 1. min, 1. K/min; Tend: 220. C |

Normal alkane RI, non-polar column, temperature ramp

Column type | Active phase | I | Reference | Comment |
---|---|---|---|---|
Capillary | HP-5 | 1145. | Yassa and Akhani, 2007 | 30. m/0.25 mm/0.32 μm, He, 60. C @ 30. min, 5. K/min; Tend: 250. C |
Capillary | DB-1 | 1146. | Facundo, Pinto, et al., 2005 | 30. m/0.25 mm/0.25 μm, He, 60. C @ 5. min, 5. K/min, 250. C @ 15. min |

Normal alkane RI, polar column, custom temperature program

Column type | Active phase | I | Reference | Comment |
---|---|---|---|---|
Capillary | HP-Innowax | 1532. | Viljoen, van Vuuren, et al., 2003 | 60. m/0.25 mm/0.25 μm; Program: 60C(10min) => 4C/min => 220C(10min) => 1C/min => 240C |

References

Aldrich Chemical Company Inc., 1990
Aldrich Chemical Company Inc.,
Catalog Handbook of Fine Chemicals, Aldrich Chemical Company, Inc., Milwaukee WI, 1990, 1. [all data]
White and Bishop, 1940
White, A.H.; Bishop, W.S.,
Dielectric Evidence of Molecular Rotation in the Crystals of Certain Non-aromatic Compounds,
J. Am. Chem. Soc., 1940, 62, 8-16. [all data]
Cherubin, 1960
Cherubin, G.,
Liaisons intermoleculaires du nitrate de cellulose avec divers solvant et plastifiants,
J. Chim. Phys., 1960, 57, 361-373. [all data]
Özel, Gögüs, et al., 2006
Özel, M.Z.; Gögüs, F.; Lewis, A.C.,
Determination of Teucrium chamaedrys volatiles by using direct thermal desorption-comprehensive two-dimensional gas chromatography-time-of-flight mass spectrometry,
J. Chromatogr. A, 2006, 1114, 1, 164-169, https://doi.org/10.1016/j.chroma.2006.02.036
. [all data]
Kjeldsen, Christensen, et al., 2003
Kjeldsen, F.; Christensen, L.P.; Edelenbos, M.,
Changes in volatile compounds of carrots (Daucus carota L.) during refrigerated and frozen storage,
J. Agric. Food Chem., 2003, 51, 18, 5400-5407, https://doi.org/10.1021/jf030212q
. [all data]
Yassa and Akhani, 2007
Yassa, N.; Akhani, H.,
The essential oils composition in two species of the genus Eriocycla Lindl. (Apiaceae) from Iran, 2007, retrieved from http://biology.ut.ac.ir/members/akhani/PdfReprintNumber/27.pdf. [all data]
Facundo, Pinto, et al., 2005
Facundo, V.A.; Pinto, A.C.; Rezende, C.M.,
Aroma compounds and volatile chemical composition of Ruellia menthoides (Nees) Hiern,
Flavour Fragr. J., 2005, 20, 1, 93-95, https://doi.org/10.1002/ffj.1380
. [all data]
Viljoen, van Vuuren, et al., 2003
Viljoen, A.; van Vuuren, S.; Ernst, E.; Klepser, M.; Demirci, B.; Baser, H.; van Wyk, B.-E.,
Osmitopsis asteriscoides (Asteraceae)-the antimicrobial activity and essential oil composition of a Cape-Dutch remedy,
J. Ethnopharmacol., 2003, 88, 2-3, 137-143, https://doi.org/10.1016/S0378-8741(03)00191-0
. [all data]