Bicyclo[2.2.1]hept-2-ene, 1,7,7-trimethyl-
- Formula: C10H16
- Molecular weight: 136.2340
- IUPAC Standard InChIKey: KUKRLSJNTMLPPK-UHFFFAOYSA-N
- CAS Registry Number: 464-17-5
- Chemical structure:
View 3d structure (requires JavaScript / HTML 5) - Other names: 2-Bornene; Bornylene; 1,7,7-Trimethyl-2-norbornene; 1,7,7-Trimethylbicyclo[2.2.1]hept-2-ene; 1,7,7-Trimethylnorbornene; 1,7,7-Trimethyl-bicyclo[2.2.1]hepten-2-ene; bornylene (2-bornene)

Van Den Dool and Kratz RI, non-polar column, custom temperature program

Column type | Active phase | I | Reference | Comment |
---|---|---|---|---|
Capillary | HP-5MS | 908.9 | Andriamaharavo, 2014 | 30. m/0.25 mm/0.25 μm, He; Program: 60C (1 min) => 5 C/min => 210C => 10 C/min => 280C (15 min) |

Normal alkane RI, non-polar column, temperature ramp

Column type | Active phase | I | Reference | Comment |
---|---|---|---|---|
Capillary | CP Sil 5 CB | 896. | Kanjilal, Kotoky, et al., 2003 | 25. m/0.25 mm/0.25 μm, He, 35. C @ 2.5 min, 5. K/min; Tend: 280. C |

Normal alkane RI, non-polar column, custom temperature program

Column type | Active phase | I | Reference | Comment |
---|---|---|---|---|
Capillary | SE-30 | 907. | Vinogradov, 2004 | Program: not specified |
Capillary | DB-5 | 908. | Isidorov, Zenkevich, et al., 1997 | Program: not specified |
Capillary | Methyl Silicone | 907. | Zenkevich, 1996 | Program: not specified |

References

Andriamaharavo, 2014
Andriamaharavo, N.R.,
Retention Data. NIST Mass Spectrometry Data Center., NIST Mass Spectrometry Data Center, 2014. [all data]
Kanjilal, Kotoky, et al., 2003
Kanjilal, P.B.; Kotoky, R.; Singh, R.S.,
Chemical composition of the leaf oil of Altingia excelsa Nornha,
Flavour Fragr. J., 2003, 18, 5, 449-450, https://doi.org/10.1002/ffj.1250
. [all data]
Vinogradov, 2004
Vinogradov, B.A.,
Production, composition, properties and application of essential oils, 2004, retrieved from http://viness.narod.ru. [all data]
Isidorov, Zenkevich, et al., 1997
Isidorov, V.; Zenkevich, I.; Sacharevich, T.,
Calculation of Gas Chromatographic Retention Indices for Monoterpenes and Terpenoids from Their Physico-Chemical Constants,
Chem. Anal. (Warsaw), 1997, 42, 627-634. [all data]
Zenkevich, 1996
Zenkevich, I.G.,
Analytical Parameters of Components of Essential Oils for their Chromatographic and Chromato-Mass Spectral Identification. Mono- and Sesquiterpenes,
Rastitelnye Resursy (Plant resources), 1996, 34, 1-2, 48-58. [all data]