Bicyclo[2.2.1]heptane, 1,7,7-trimethyl-
- Formula: C10H18
- Molecular weight: 138.2499
- IUPAC Standard InChIKey: BEWYHVAWEKZDPP-UHFFFAOYSA-N
- CAS Registry Number: 464-15-3
- Chemical structure:
View 3d structure (requires JavaScript / HTML 5) - Other names: Bornane; Bornylane; Camphane; 1,7,7-Trimethylbicyclo[2.2.1]heptane

Kovats' RI, non-polar column, isothermal

Column type | Active phase | Temperature (C) | I | Reference | Comment |
---|---|---|---|---|---|
Capillary | Apiezon L | 100. | 980. | Morishita, Okano, et al., 1980 | Column length: 45. m; Column diameter: 0.25 mm |

Kovats' RI, polar column, temperature ramp

Column type | Active phase | I | Reference | Comment |
---|---|---|---|---|
Capillary | DB-Wax | 1131. | Umano and Shibamoto, 1987 | He, 40. C @ 10. min, 2. K/min; Column length: 60. m; Column diameter: 0.25 mm; Tend: 200. C |

Van Den Dool and Kratz RI, polar column, temperature ramp

Column type | Active phase | I | Reference | Comment |
---|---|---|---|---|
Capillary | DB-Wax | 1144. | Chung, Eiserich, et al., 1994 | He, 60. C @ 4. min, 3. K/min, 220. C @ 30. min; Column length: 60. m; Column diameter: 0.25 mm |

Normal alkane RI, polar column, temperature ramp

Column type | Active phase | I | Reference | Comment |
---|---|---|---|---|
Capillary | DB-Wax | 1140. | Chung, Eiserich, et al., 1993 | 60. C @ 4. min, 3. K/min; Column length: 60. m; Column diameter: 0.25 mm; Tend: 220. C |

Phase change data

Data compiled by: Thermodynamics Research Center, NIST Boulder Laboratories, Chris Muzny director
Quantity | Value | Units | Method | Reference | Comment |
---|---|---|---|---|---|
Tfus | 429.4 | K | N/A | Clement, Vilkas, et al., 1956 | Uncertainty assigned by TRC = 2. K |
Tfus | 431. | K | N/A | Sager and Bradley, 1956 | Uncertainty assigned by TRC = 5. K |

References

Morishita, Okano, et al., 1980
Morishita, F.; Okano, T.; Kojima, T.,
Retention indices of monocyclic monoterpene hydrocarbons,
Bunseki Kagaku, 1980, 29, 1, 48-53, https://doi.org/10.2116/bunsekikagaku.29.48
. [all data]
Umano and Shibamoto, 1987
Umano, K.; Shibamoto, T.,
Analysis of headspace volatiles from overheated beef fat,
J. Agric. Food Chem., 1987, 35, 1, 14-18, https://doi.org/10.1021/jf00073a004
. [all data]
Chung, Eiserich, et al., 1994
Chung, T.Y.; Eiserich, J.P.; Shibamoto, T.,
Volatile compounds produced from peanut oil heated with different amounts of cysteine,
J. Agric. Food Chem., 1994, 42, 8, 1743-1746, https://doi.org/10.1021/jf00044a032
. [all data]
Chung, Eiserich, et al., 1993
Chung, T.Y.; Eiserich, J.P.; Shibamoto, T.,
Volatile compounds identified in headspace samples of peanut oil heated under temperatures ranging from 50 to 200 °C,
J. Agric. Food Chem., 1993, 41, 9, 1467-1470, https://doi.org/10.1021/jf00033a022
. [all data]