Methanamine, 1,1-dimethoxy-N,N-dimethyl-
- Formula: C5H13NO2
- Molecular weight: 119.1622
- IUPAC Standard InChIKey: ZSXGLVDWWRXATF-UHFFFAOYSA-N
- CAS Registry Number: 4637-24-5
- Chemical structure:
View 3d structure (requires JavaScript / HTML 5) - Other names: Trimethylamine, 1,1-dimethoxy-; Dimethoxy(dimethylamino)methane; Dimethylformamide dimethyl acetal; DMF Dimethyl acetal; N-(Dimethoxymethyl)dimethylamine; N,N-Dimethylformamide dimethyl acetal; 1,1-Dimethoxytrimethylamine; 1,1-Dimethoxy-N,N-dimethyl-methylamine

Gas phase thermochemistry data

Data compiled by: Hussein Y. Afeefy, Joel F. Liebman, and Stephen E. Stein
Quantity | Value | Units | Method | Reference | Comment |
---|---|---|---|---|---|
ΔfH°gas | -356. | kJ/mol | Cm | Guthrie, 1974 | Heat of hydrolysis[kcal/mol]=-14.9 |

Condensed phase thermochemistry data

Data compiled by: Hussein Y. Afeefy, Joel F. Liebman, and Stephen E. Stein
Quantity | Value | Units | Method | Reference | Comment |
---|---|---|---|---|---|
ΔfH°liquid | -395. | kJ/mol | Cm | Guthrie, 1974 | Heat of hydrolysis[kcal/mol]=-14.9 |

Phase change data

Data compiled by: Robert L. Brown and Stephen E. Stein
Reduced pressure boiling point
Tboil (K) | Pressure (bar) | Reference |
---|---|---|
375.7 | 0.960 | Weast and Grasselli, 1989 |

Normal alkane RI, non-polar column, custom temperature program

Column type | Active phase | I | Reference | Comment |
---|---|---|---|---|
Capillary | Polydimethyl siloxanes | 726. | Zenkevich, 2001 | Program: not specified |

References

Guthrie, 1974
Guthrie, J.P.,
Hydration of carboxamides. Evaluation of the free energy change for addition of water to acetamide and formamide derivatives,
J. Am. Chem. Soc., 1974, 96, 3608-3615. [all data]
Weast and Grasselli, 1989
CRC Handbook of Data on Organic Compounds, 2nd Editon, Weast,R.C and Grasselli, J.G., ed(s)., CRC Press, Inc., Boca Raton, FL, 1989, 1. [all data]
Zenkevich, 2001
Zenkevich, I.G.,
Encyclopedia of Chromatography. Derivatization of Amines, Amino Acids, Amides and Imides for GC Analysis, Marcel Dekker, Inc, New York - Basel, 2001, 224. [all data]