3-Pentenenitrile
- Formula: C5H7N
- Molecular weight: 81.1158
- IUPAC Standard InChIKey: UVKXJAUUKPDDNW-UHFFFAOYSA-N
- CAS Registry Number: 4635-87-4
- Chemical structure:
View 3d structure (requires JavaScript / HTML 5) - Stereoisomers:
- Other names: 3-Pentenonitrile; pent-3-enenitrile

Phase change data

Data compiled by: Robert L. Brown and Stephen E. Stein
Quantity | Value | Units | Method | Reference | Comment |
---|---|---|---|---|---|
Tboil | 417. to 420. | K | N/A | Frinton Laboratories Inc., 1986 |

References

Frinton Laboratories Inc., 1986
Frinton Laboratories Inc.,
Catalog Number 11, Frinton Laboratories Inc., Vineland, NJ, 1986, 99. [all data]