methanediol
- Formula: CH4O2
- Molecular weight: 48.0413
- CAS Registry Number: 463-57-0

Gas phase thermochemistry data

Data compiled by: Glushko Thermocenter, Russian Academy of Sciences, Moscow
Constant pressure heat capacity of gas
Cp,gas (cal/mol*K) | Temperature (K) | Reference | Comment |
---|---|---|---|
12.60 | 273.16 | Rodler M., 1986 | These values were obtained using molecular parameters determined by ab initio calculation. From comparison with estimations by difference method [ Dorofeeva O.V., 1997], one may expect that entropy values are underestimated by 15-30 J/mol*K. |
13.35 | 298.16 | ||
14.13 | 323.16 | ||
14.90 | 348.16 | ||
15.66 | 373.16 | ||
16.39 | 398.16 |

References

Rodler M., 1986
Rodler M.,
Ab initio studies of the structures and energies of methanediol and 1,1-ethenediol,
Chem. Phys., 1986, 105, 345-353. [all data]
Dorofeeva O.V., 1997
Dorofeeva O.V.,
Unpublished results. Thermocenter of Russian Academy of Science, Moscow, 1997. [all data]