9,12,15-Octadecatrienoic acid, (Z,Z,Z)-
- Formula: C18H30O2
- Molecular weight: 278.4296
- IUPAC Standard InChIKey: DTOSIQBPPRVQHS-PDBXOOCHSA-N
- CAS Registry Number: 463-40-1
- Chemical structure:
View 3d structure (requires JavaScript / HTML 5) - Stereoisomers:
- Other names: Linolenic acid; α-Linolenic acid; All-cis-9,12,15-Octadecatrienoic acid; cis,cis,cis-9,12,15-Octadecatrienoic acid; (Z,Z,Z)-9,12,15-Octadecatrienoic acid; Industrene 120

Condensed phase thermochemistry data

Data compiled by: Hussein Y. Afeefy, Joel F. Liebman, and Stephen E. Stein
Quantity | Value | Units | Method | Reference | Comment |
---|---|---|---|---|---|
ΔfH°liquid | -508.8 | kJ/mol | Chyd | Rogers, Hoyte, et al., 1978 |

Phase change data

Data compiled by: Robert L. Brown and Stephen E. Stein
Reduced pressure boiling point
Tboil (K) | Pressure (bar) | Reference |
---|---|---|
504.2 | 0.001 | Aldrich Chemical Company Inc., 1990 |

Reaction thermochemistry data

Data compiled by: Hussein Y. Afeefy, Joel F. Liebman, and Stephen E. Stein
Individual Reactions
By formula: 3H2 + C18H30O2 = C18H36O2
Quantity | Value | Units | Method | Reference | Comment |
---|---|---|---|---|---|
ΔrH° | -380.2 ± 1.9 | kJ/mol | Chyd | Rogers, Hoyte, et al., 1978 | liquid phase; solvent: Hexane |

Normal alkane RI, non-polar column, temperature ramp

Data compiled by: NIST Mass Spectrometry Data Center, William E. Wallace, director

Column type CapillaryCapillaryCapillaryCapillaryCapillary
Active phase HP-5 MSDB-5 MSHP-5 MSOV-1HP-5 MS
Column length (m) 30.30.30.30.30.
Carrier gas HeliumHeliumHeliumHeliumHelium
Substrate
Column diameter (mm) 0.250.250.250.250.25
Phase thickness (μm) 0.250.250.250.250.25
Tstart (C) 40.70.70.40.50.
Tend (C) 260.290.290.300.280.
Heat rate (K/min) 4.5.5.4.4.
Initial hold (min)    2.
Final hold (min) 5.10.10.10.
I 2154.2134.2143.2122.2159.
ReferenceMiyazawa, Marumoto, et al., 2011Stojanovic, RAdulovic, et al., 2011Radulovic, Blagojevic, et al., 2010Nibret and Wink, 2009Zhao, Zeng, et al., 2009
Comment MSDC-RI MSDC-RI MSDC-RI MSDC-RI MSDC-RI
Column type CapillaryCapillaryCapillaryCapillaryCapillary
Active phase HP-101Elite-5MSDB-5DB-5OV-101
Column length (m) 25.30.30.30.50.
Carrier gas HeHeHeHeNitrogen
Substrate
Column diameter (mm) 0.20.320.250.250.25
Phase thickness (μm) 0.20.50.250.25
Tstart (C) 70.40.60.40.70.
Tend (C) 200.280.240.250.200.
Heat rate (K/min) 3.4.3.2.2.
Initial hold (min) 2.5. 5.
Final hold (min)  10. 20.
I 2102.2107.2116.2116.2115.
ReferenceJerkovic, Mastelic, et al., 2007Tava, Pecetti, et al., 2007Miyazawa, Nishiguchi, et al., 2005Senatore, Rigano, et al., 2004Sugisawa, Nakamura, et al., 1990
Comment MSDC-RI MSDC-RI MSDC-RI MSDC-RI MSDC-RI
Column type Capillary
Active phase OV-101
Column length (m) 50.
Carrier gas Nitrogen
Substrate
Column diameter (mm) 0.25
Phase thickness (μm)
Tstart (C) 80.
Tend (C) 200.
Heat rate (K/min) 2.
Initial hold (min)
Final hold (min)
I 2113.
ReferenceSugisawa, Nakamura, et al., 1990
Comment MSDC-RI

References

Rogers, Hoyte, et al., 1978
Rogers, D.W.; Hoyte, O.P.A.; Ho, R.K.C.,
Heats of hydrogenation of large molecules. Part 2. Six unsaturated and polyunsaturated fatty acids,
J. Chem. Soc. Faraday Trans. 1, 1978, 74, 46-52. [all data]
Aldrich Chemical Company Inc., 1990
Aldrich Chemical Company Inc.,
Catalog Handbook of Fine Chemicals, Aldrich Chemical Company, Inc., Milwaukee WI, 1990, 1. [all data]