1-Fluorononane
- Formula: C9H19F
- Molecular weight: 146.2456
- IUPAC Standard InChIKey: ITPAUTYYXIENLO-UHFFFAOYSA-N
- CAS Registry Number: 463-18-3
- Chemical structure:
View 3d structure (requires JavaScript / HTML 5) - Other names: n-Nonyl fluoride; Nonane, 1-fluoro-

Gas phase thermochemistry data

Data compiled by: Hussein Y. Afeefy, Joel F. Liebman, and Stephen E. Stein
Quantity | Value | Units | Method | Reference | Comment |
---|---|---|---|---|---|
ΔfH°gas | -423.5 ± 2.2 | kJ/mol | Ccr | Schaffer, Verevkin, et al., 1997 |

Condensed phase thermochemistry data

Data compiled by: Hussein Y. Afeefy, Joel F. Liebman, and Stephen E. Stein
Quantity | Value | Units | Method | Reference | Comment |
---|---|---|---|---|---|
ΔfH°liquid | -474.3 ± 2.0 | kJ/mol | Ccr | Schaffer, Verevkin, et al., 1997 | |
Quantity | Value | Units | Method | Reference | Comment |
ΔcH°liquid | -5962.5 ± 2.0 | kJ/mol | Ccr | Schaffer, Verevkin, et al., 1997 |

Phase change data

Data compiled as indicated in comments:
BS - Robert L. Brown and Stephen E. Stein
ALS - Hussein Y. Afeefy, Joel F. Liebman, and Stephen E. Stein
AC - William E. Acree, Jr., James S. Chickos
Quantity | Value | Units | Method | Reference | Comment |
---|---|---|---|---|---|
Tboil | 440.7 | K | N/A | Aldrich Chemical Company Inc., 1990 | BS |
Quantity | Value | Units | Method | Reference | Comment |
ΔvapH° | 50.84 ± 0.88 | kJ/mol | V | Schaffer, Verevkin, et al., 1997 | ALS |
ΔvapH° | 50.8 ± 0.9 | kJ/mol | GS | Steele, Chirico, et al., 1994 | Based on data from 278. to 313. K.; AC |
Enthalpy of vaporization
ΔvapH (kJ/mol) | Temperature (K) | Method | Reference | Comment |
---|---|---|---|---|
46.8 | 348. | A,EST | Stephenson and Malanowski, 1987 | Based on data from 333. to 473. K. See also Li and Rossini, 1961, Dykyj and Vanko, 1970, and Dykyj, Svoboda, et al., 1999.; AC |

References

Schaffer, Verevkin, et al., 1997
Schaffer, F.; Verevkin, S.P.; Rieger, H.J.; Beckhaus, H.D.; Ruchardt, C.,
Enthalpies of formation of a series of fluorinated hydrocarbons and strain-free group increments to assess polar and anomeric stabilization and strain,
Liebigs Ann., 1997, 1333-1344. [all data]
Aldrich Chemical Company Inc., 1990
Aldrich Chemical Company Inc.,
Catalog Handbook of Fine Chemicals, Aldrich Chemical Company, Inc., Milwaukee WI, 1990, 1. [all data]
Steele, Chirico, et al., 1994
Steele, W.V.; Chirico, R.D.; Nguyen, A.; Knipmeyer, S.E.,
The thermodynamic properties of 2-methylaniline and trans-(r,S)-decahydroquinoline,
J. Chem. Thermodyn., 1994, 26, 515-544. [all data]
Stephenson and Malanowski, 1987
Stephenson, Richard M.; Malanowski, Stanislaw,
Handbook of the Thermodynamics of Organic Compounds, 1987, https://doi.org/10.1007/978-94-009-3173-2
. [all data]
Li and Rossini, 1961
Li, J.C.M.; Rossini, F.D.,
Vapor Pressures and Boiling Points of the l-Fluoroalkanes, l-Chloroalkanes, l-Bromoalkanes, and l-Iodoalkanes, C 1 to C 20 .,
J. Chem. Eng. Data, 1961, 6, 2, 268-270, https://doi.org/10.1021/je60010a025
. [all data]
Dykyj and Vanko, 1970
Dykyj, J.; Vanko, A.,
Petrochemica, 1970, 10, 1, 3. [all data]
Dykyj, Svoboda, et al., 1999
Dykyj, J.; Svoboda, J.; Wilhoit, R.C.; Frenkel, M.L.; Hall, K.R.,
Vapor Pressure of Chemicals: Part A. Vapor Pressure and Antoine Constants for Hydrocarbons and Sulfur, Selenium, Tellurium and Hydrogen Containing Organic Compounds, Springer, Berlin, 1999, 373. [all data]