Cyclopentanecarboxylic acid, 1-methyl-, methyl ester
- Formula: C8H14O2
- Molecular weight: 142.1956
- IUPAC Standard InChIKey: SUCGJXDLZCDFRV-UHFFFAOYSA-N
- CAS Registry Number: 4630-83-5
- Chemical structure:
View 3d structure (requires JavaScript / HTML 5) - Other names: Cyclopentanoic acid, 1-methyl, methyl ester

Phase change data

Data compiled by: Robert L. Brown and Stephen E. Stein
Reduced pressure boiling point
Tboil (K) | Pressure (bar) | Reference |
---|---|---|
432.7 | 0.961 | Weast and Grasselli, 1989 |
359.7 | 0.027 | Weast and Grasselli, 1989 |

Kovats' RI, non-polar column, isothermal

Column type | Active phase | Temperature (C) | I | Reference | Comment |
---|---|---|---|---|---|
Packed | Squalane | 150. | 925. | Schomburg, 1964 | |
Packed | Squalane | 150. | 925. | Schomburg, 1964 |

References

Weast and Grasselli, 1989
CRC Handbook of Data on Organic Compounds, 2nd Editon, Weast,R.C and Grasselli, J.G., ed(s)., CRC Press, Inc., Boca Raton, FL, 1989, 1. [all data]
Schomburg, 1964
Schomburg, G.,
Gas-Chromatographische Retentionsdaten und Struktur Chemischer Verbindungen. I. Verzweigte Aliphatische und Alicyclische Carbonsäure-Methylester,
J. Chromatogr., 1964, 14, 157-177, https://doi.org/10.1016/S0021-9673(00)86608-X
. [all data]