Cyclohexanecarboxylic acid, methyl ester
- Formula: C8H14O2
- Molecular weight: 142.1956
- IUPAC Standard InChIKey: ZQWPRMPSCMSAJU-UHFFFAOYSA-N
- CAS Registry Number: 4630-82-4
- Chemical structure:
View 3d structure (requires JavaScript / HTML 5) - Other names: Hexahydrobenzoic acid methyl ester; Methyl cyclohexanecarboxylate; Methyl cyclohexanoate; Methyl cyclohexylcarboxylate; Methyl ester of cyclohexanecarboxylic acid; c-C6H11COOCH3

Phase change data

Data compiled as indicated in comments:
BS - Robert L. Brown and Stephen E. Stein
TRC - Thermodynamics Research Center, NIST Boulder Laboratories, Chris Muzny director
Quantity | Value | Units | Method | Reference | Comment |
---|---|---|---|---|---|
Tboil | 456.2 | K | N/A | Weast and Grasselli, 1989 | BS |
Tboil | 456.2 | K | N/A | Lumsden, 1905 | Uncertainty assigned by TRC = 1. K; TRC |
Reduced pressure boiling point
Tboil (K) | Pressure (bar) | Reference | Comment |
---|---|---|---|
346.2 | 0.020 | Weast and Grasselli, 1989 | BS |

Gas phase ion energetics data

Data evaluated by: Edward P. Hunter and Sharon G. Lias
Quantity | Value | Units | Method | Reference | Comment |
---|---|---|---|---|---|
Proton affinity (review) | 846.2 | kJ/mol | N/A | Hunter and Lias, 1998 | |
Quantity | Value | Units | Method | Reference | Comment |
Gas basicity | 815.3 | kJ/mol | N/A | Hunter and Lias, 1998 |

References

Weast and Grasselli, 1989
CRC Handbook of Data on Organic Compounds, 2nd Editon, Weast,R.C and Grasselli, J.G., ed(s)., CRC Press, Inc., Boca Raton, FL, 1989, 1. [all data]
Lumsden, 1905
Lumsden, J.S.,
The physical properties of heptoic, hexahydrobenzoic, and benzoic acids and their derivatives,
J. Chem. Soc., 1905, 87, 90-98. [all data]
Hunter and Lias, 1998
Hunter, E.P.; Lias, S.G.,
Evaluated Gas Phase Basicities and Proton Affinities of Molecules: An Update,
J. Phys. Chem. Ref. Data, 1998, 27, 3, 413-656, https://doi.org/10.1063/1.556018
. [all data]