Cyclohexanecarboxylic acid, 1-ethyl-, methyl ester
- Formula: C10H18O2
- Molecular weight: 170.2487
- IUPAC Standard InChIKey: JPAPFFYGFBXJAK-UHFFFAOYSA-N
- CAS Registry Number: 4630-81-3
- Chemical structure:
View 3d structure (requires JavaScript / HTML 5) - Other names: Methyl 1-ethyl-1-cyclohexanecarboxylate

Kovats' RI, non-polar column, isothermal

Column type | Active phase | Temperature (C) | I | Reference | Comment |
---|---|---|---|---|---|
Packed | Squalane | 150. | 1122. | Schomburg, 1964 | |
Packed | Squalane | 150. | 1122. | Schomburg, 1964 |

References

Schomburg, 1964
Schomburg, G.,
Gas-Chromatographische Retentionsdaten und Struktur Chemischer Verbindungen. I. Verzweigte Aliphatische und Alicyclische Carbonsäure-Methylester,
J. Chromatogr., 1964, 14, 157-177, https://doi.org/10.1016/S0021-9673(00)86608-X
. [all data]