Methyl cyclopentanecarboxylate
- Formula: C7H12O2
- Molecular weight: 128.1690
- IUPAC Standard InChIKey: IIHIJFJSXPDTNO-UHFFFAOYSA-N
- CAS Registry Number: 4630-80-2
- Chemical structure:
View 3d structure (requires JavaScript / HTML 5) - Other names: Cyclopentanecarboxylic acid, methyl ester

Kovats' RI, non-polar column, isothermal

Column type | Active phase | Temperature (C) | I | Reference | Comment |
---|---|---|---|---|---|
Packed | Squalane | 120. | 898. | Schomburg, 1964 | |
Packed | Squalane | 150. | 892. | Schomburg, 1964 | |
Packed | Squalane | 150. | 902. | Schomburg, 1964 |

References

Schomburg, 1964
Schomburg, G.,
Gas-Chromatographische Retentionsdaten und Struktur Chemischer Verbindungen. I. Verzweigte Aliphatische und Alicyclische Carbonsäure-Methylester,
J. Chromatogr., 1964, 14, 157-177, https://doi.org/10.1016/S0021-9673(00)86608-X
. [all data]