1,5-Pentanediamine
- Formula: C5H14N2
- Molecular weight: 102.1781
- IUPAC Standard InChIKey: VHRGRCVQAFMJIZ-UHFFFAOYSA-N
- CAS Registry Number: 462-94-2
- Chemical structure:
View 3d structure (requires JavaScript / HTML 5) - Other names: Pentamethylenediamine; Pentane-1,5-diamine; Animal coniine; Cadaverine; 1,5-Diaminopentane; H2N(CH2)5NH2; Cadaverin; 1,5-Pentamethylenediamine

Phase change data

Data compiled as indicated in comments:
BS - Robert L. Brown and Stephen E. Stein
TRC - Thermodynamics Research Center, NIST Boulder Laboratories, Chris Muzny director
AC - William E. Acree, Jr., James S. Chickos
Quantity | Value | Units | Method | Reference | Comment |
---|---|---|---|---|---|
Tboil | 452.2 | K | N/A | Weast and Grasselli, 1989 | BS |
Tboil | 451.65 | K | N/A | Perkin, 1889 | Uncertainty assigned by TRC = 1.5 K; TRC |
Tboil | 452.65 | K | N/A | Perkin, 1889 | Uncertainty assigned by TRC = 2. K; TRC |
Enthalpy of fusion
ΔfusH (kJ/mol) | Temperature (K) | Method | Reference | Comment |
---|---|---|---|---|
29.82 | 285. | DSC | Dall'Acqua, Della Gatta, et al., 2002 | AC |

Gas phase ion energetics data

Data evaluated as indicated in comments:
HL - Edward P. Hunter and Sharon G. Lias
Data compiled as indicated in comments:
MM - Michael M. Meot-Ner (Mautner)
Quantity | Value | Units | Method | Reference | Comment |
---|---|---|---|---|---|
Proton affinity (review) | 999.6 | kJ/mol | N/A | Hunter and Lias, 1998 | HL |
Quantity | Value | Units | Method | Reference | Comment |
Gas basicity | 946.2 | kJ/mol | N/A | Hunter and Lias, 1998 | HL |
Proton affinity at 298K
Proton affinity (kJ/mol) | Reference | Comment |
---|---|---|
980.3 | Wang, Chu, et al., 1999 | KM results obtained from CID of complexes with secondary amines at E(cm) = 0 eV, extrapolated from CID at E(cm) = 0.8, 1.5, 2.0 eV; MM |
1008. | Wang, Chu, et al., 1999 | KM results obtained from CID of complexes with secondary amines using Fenselau/Wesdemiotis correction; MM |

Kovats' RI, non-polar column, custom temperature program

Column type | Active phase | I | Reference | Comment |
---|---|---|---|---|
Packed | SE-30 | 1035. | Ramsey, Lee, et al., 1980 | He, Chromosorb G HP (80-100 mesh); Column length: 1.5 m; Program: not specified |

Van Den Dool and Kratz RI, polar column, temperature ramp

Column type | Active phase | I | Reference | Comment |
---|---|---|---|---|
Capillary | HP-Wax | 1537. | Peng, 2000 | 15. m/0.53 mm/1. μm, He, 40. C @ 3. min, 5. K/min, 220. C @ 30. min |

Normal alkane RI, non-polar column, custom temperature program

Column type | Active phase | I | Reference | Comment |
---|---|---|---|---|
Other | Methyl Silicone | 1035. | Ardrey and Moffat, 1981 | Program: not specified |

References

Weast and Grasselli, 1989
CRC Handbook of Data on Organic Compounds, 2nd Editon, Weast,R.C and Grasselli, J.G., ed(s)., CRC Press, Inc., Boca Raton, FL, 1989, 1. [all data]
Perkin, 1889
Perkin, W.H.,
The Magneto Rotatory Power of Nitrogne Compounds. also of Hydrochloric Hydrobromic and Hydroioidic Acids and of some of the Salts of Ammonia and the Compound Ammonias,
J. Chem. Soc., 1889, 55, 680. [all data]
Dall'Acqua, Della Gatta, et al., 2002
Dall'Acqua, Lorenzo; Della Gatta, Giuseppe; Nowicka, Bozenna; Ferloni, Paolo,
Enthalpies and entropies of fusion of ten alkane-α, ω-diamines H2 N-- (CH 2)n-- NH2 where 3≤n≤12,
The Journal of Chemical Thermodynamics, 2002, 34, 1, 1-12, https://doi.org/10.1006/jcht.2001.0950
. [all data]
Hunter and Lias, 1998
Hunter, E.P.; Lias, S.G.,
Evaluated Gas Phase Basicities and Proton Affinities of Molecules: An Update,
J. Phys. Chem. Ref. Data, 1998, 27, 3, 413-656, https://doi.org/10.1063/1.556018
. [all data]
Wang, Chu, et al., 1999
Wang, Z.; Chu, I.K.; Rodriquez, C.F.; Hopkinson, A.C.; Siu, K.W.M.,
α,ω-Diaminoalkanes as models for bases that dicoordinate the proton: An evaluation of the kinetic method for estimating their proton affinities,
J. Phys. Chem. A., 1999, 103, 8700. [all data]
Ramsey, Lee, et al., 1980
Ramsey, J.D.; Lee, T.D.; Osselton, M.D.; Moffat, A.C.,
Gas-liquid chromatographic retention indices of 296 non-drug substances on SE-30 or OV-1 likely to be encountered in toxicological analyses,
J. Chromatogr., 1980, 184, 2, 185-206, https://doi.org/10.1016/S0021-9673(00)85641-1
. [all data]
Peng, 2000
Peng, C.T.,
Prediction of retention indices. V. Influence of electronic effects and column polarity on retention index,
J. Chromatogr. A, 2000, 903, 1-2, 117-143, https://doi.org/10.1016/S0021-9673(00)00901-8
. [all data]
Ardrey and Moffat, 1981
Ardrey, R.E.; Moffat, A.C.,
Gas-liquid chromatographic retention indices of 1318 substances of toxicological interest on SE-30 or OV-1 stationary phase,
J. Chromatogr., 1981, 220, 3, 195-252, https://doi.org/10.1016/S0021-9673(00)81925-1
. [all data]