Propane, 1,3-difluoro-
- Formula: C3H6F2
- Molecular weight: 80.0765
- IUPAC Standard InChIKey: OOLOYCGJRJFTPM-UHFFFAOYSA-N
- CAS Registry Number: 462-39-5
- Chemical structure:
View 3d structure (requires JavaScript / HTML 5) - Other names: 1,3-difluoropropane

Normal alkane RI, non-polar column, temperature ramp

Column type | Active phase | I | Reference | Comment |
---|---|---|---|---|
Capillary | OV-101 | 481. | Zenkevich, 2005 | 25. m/0.20 mm/0.10 μm, N2/He, 6. K/min; Tstart: 50. C; Tend: 250. C |

References

Zenkevich, 2005
Zenkevich, I.G.,
Experimentally measured retention indices., 2005. [all data]