Octanoic acid, 6,8-dimercapto-
- Formula: C8H16O2S2
- Molecular weight: 208.341
- IUPAC Standard InChIKey: IZFHEQBZOYJLPK-UHFFFAOYSA-N
- CAS Registry Number: 462-20-4
- Chemical structure:
View 3d structure (requires JavaScript / HTML 5) - Other names: Dihydrolipoic acid

Reaction thermochemistry data

Data compiled by: Hussein Y. Afeefy, Joel F. Liebman, and Stephen E. Stein
Individual Reactions
By formula: C8H16O2S2 + I2 = 2HI + C8H14O2S2
Quantity | Value | Units | Method | Reference | Comment |
---|---|---|---|---|---|
ΔrH° | -109.6 | kJ/mol | Cm | Sunner, 1955 | liquid phase; solvent: Ethanol/water(90/10) |

References

Sunner, 1955
Sunner, S.,
Strain in 6,8-thioctic acid,
Nature (London), 1955, 176, 217. [all data]