7-Tridecanone
- Formula: C13H26O
- Molecular weight: 198.3449
- IUPAC Standard InChIKey: ULIAPOFMBCCSPE-UHFFFAOYSA-N
- CAS Registry Number: 462-18-0
- Chemical structure:
View 3d structure (requires JavaScript / HTML 5) - Other names: Dihexyl ketone; Enanthone; Hexyl ketone; di-Normal-hexyl ketone; di-n-Hexyl ketone; tridecan-7-one

Phase change data

Data compiled as indicated in comments:
TRC - Thermodynamics Research Center, NIST Boulder Laboratories, Chris Muzny director
AC - William E. Acree, Jr., James S. Chickos
Quantity | Value | Units | Method | Reference | Comment |
---|---|---|---|---|---|
Tc | 708.2 | K | N/A | Pulliam, Gude, et al., 1995 | Uncertainty assigned by TRC = 2.8 K; TRC |
Quantity | Value | Units | Method | Reference | Comment |
ρc | 1.20 | mol/l | N/A | Pulliam, Gude, et al., 1995 | Uncertainty assigned by TRC = 0.04 mol/l; TRC |
Enthalpy of vaporization
ΔvapH (kJ/mol) | Temperature (K) | Method | Reference | Comment |
---|---|---|---|---|
62.7 | 410. | A | Stephenson and Malanowski, 1987 | Based on data from 395. to 600. K.; AC |
49.3 | 536. | N/A | Ambrose, Ellender, et al., 1975 | Based on data from 396. to 623. K.; AC |
Enthalpy of sublimation
ΔsubH (kJ/mol) | Temperature (K) | Method | Reference | Comment |
---|---|---|---|---|
103.8 | 290. | ME | Ubbelohde, 1938 | Based on data from 287. to 293. K.; AC |

Normal alkane RI, non-polar column, isothermal

Data compiled by: NIST Mass Spectrometry Data Center, William E. Wallace, director

Column type Capillary
Active phase OV-1
Column length (m)
Carrier gas
Substrate
Column diameter (mm)
Phase thickness (μm)
Temperature (C) 60.
I 1448.
ReferenceAmboni, Junkes, et al., 2002
Comment MSDC-RI

References

Pulliam, Gude, et al., 1995
Pulliam, M.K.; Gude, M.T.; Teja, A.S.,
Critical Temperatures and Densities of n-Alkanones,
J. Chem. Eng. Data, 1995, 40, 455-8. [all data]
Stephenson and Malanowski, 1987
Stephenson, Richard M.; Malanowski, Stanislaw,
Handbook of the Thermodynamics of Organic Compounds, 1987, https://doi.org/10.1007/978-94-009-3173-2
. [all data]
Ambrose, Ellender, et al., 1975
Ambrose, D.; Ellender, J.H.; Lees, E.B.; Sprake, C.H.S.; Townsend, R.,
Thermodynamic properties of organic oxygen compounds XXXVIII. Vapour pressures of some aliphatic ketones,
The Journal of Chemical Thermodynamics, 1975, 7, 5, 453-472, https://doi.org/10.1016/0021-9614(75)90275-X
. [all data]
Ubbelohde, 1938
Ubbelohde, A.R.,
Structure and thermodynamic properties of long-chain compounds,
Trans. Faraday Soc., 1938, 34, 282, https://doi.org/10.1039/tf9383400282
. [all data]