2-(tert-Butylamino)ethanol
- Formula: C6H15NO
- Molecular weight: 117.1894
- IUPAC Standard InChIKey: IUXYVKZUDNLISR-UHFFFAOYSA-N
- CAS Registry Number: 4620-70-6
- Chemical structure:
View 3d structure (requires JavaScript / HTML 5) - Other names: N-t-Butylethanolamine; tert-Butylethanolamine; N-tert-Butylethanolamine; Ethanol, 2-[(1,1-dimethylethyl)amino]-; β-tert-Butylaminoethanol; tert-Butylaminoethanol; Ethanol, 2-(tert-butylamino)-; NSC 78430

Phase change data

Data compiled by: Robert L. Brown and Stephen E. Stein
Quantity | Value | Units | Method | Reference | Comment |
---|---|---|---|---|---|
Tboil | 449.7 | K | N/A | Weast and Grasselli, 1989 |
Reduced pressure boiling point
Tboil (K) | Pressure (bar) | Reference |
---|---|---|
364.2 | 0.033 | Aldrich Chemical Company Inc., 1990 |
363. to 365. | 0.033 | Frinton Laboratories Inc., 1986 |

References

Weast and Grasselli, 1989
CRC Handbook of Data on Organic Compounds, 2nd Editon, Weast,R.C and Grasselli, J.G., ed(s)., CRC Press, Inc., Boca Raton, FL, 1989, 1. [all data]
Aldrich Chemical Company Inc., 1990
Aldrich Chemical Company Inc.,
Catalog Handbook of Fine Chemicals, Aldrich Chemical Company, Inc., Milwaukee WI, 1990, 1. [all data]
Frinton Laboratories Inc., 1986
Frinton Laboratories Inc.,
Catalog Number 11, Frinton Laboratories Inc., Vineland, NJ, 1986, 99. [all data]