Benzene, 1,1'-(1,2-dimethyl-1,2-ethanediyl)bis-, (R*,S*)-
- Formula: C16H18
- Molecular weight: 210.3141
- IUPAC Standard InChIKey: NGCFVIRRWORSML-OKILXGFUSA-N
- CAS Registry Number: 4613-11-0
- Chemical structure:
View 3d structure (requires JavaScript / HTML 5) - Species with the same structure:
- Stereoisomers:
- Other names: Bibenzyl, α,α'-dimethyl-, erythro-; erythro-2,3-Diphenylbutane; meso-2,3-Diphenylbutane; Benzene, 1,1'-(1,2-dimethyl-1,2-ethanediyl)bis-, [r-(R*,S*)]-

Condensed phase thermochemistry data

Data compiled by: Hussein Y. Afeefy, Joel F. Liebman, and Stephen E. Stein
Quantity | Value | Units | Method | Reference | Comment |
---|---|---|---|---|---|
ΔcH°solid | -8912. | kJ/mol | Ccb | Serijan and Wise, 1952 | Corresponding ΔfHºsolid = 42. kJ/mol (simple calculation by NIST; no Washburn corrections) |

Phase change data

Data compiled by: Thermodynamics Research Center, NIST Boulder Laboratories, Chris Muzny director
Quantity | Value | Units | Method | Reference | Comment |
---|---|---|---|---|---|
Tfus | 399.9 | K | N/A | Serijan and Wise, 1952, 2 | Uncertainty assigned by TRC = 1. K |
Tfus | 395. | K | N/A | Terent'eva and Tsukervanik, 1952 | Uncertainty assigned by TRC = 5. K; stereoisomer not identified |

References

Serijan and Wise, 1952
Serijan, K.T.; Wise, P.H.,
Dicyclic hydrocarbons. V. Synthesis and physical properties of the diphenyl- and dicyclohexylbutanes,
J. Am. Chem. Soc., 1952, 74, 365-368. [all data]
Serijan and Wise, 1952, 2
Serijan, K.T.; Wise, P.H.,
Dicyclic hydrocarbons. V. Synthesis and physical properties of the diphenyl - and dicyclohexylbutanes,
J. Am. Chem. Soc., 1952, 74, 365-8. [all data]
Terent'eva and Tsukervanik, 1952
Terent'eva, I.V.; Tsukervanik, I.P.,
Hydroxylation of Aromatic Compounds with 1,3-Butanediol,
Dokl. Akad. Nauk SSSR, 1952, 86, 555. [all data]