C8H5O4-2
- Formula: C8H5O4-2
- Molecular weight: 165.1240
- CAS Registry Number: 46093-15-6

Gas phase ion energetics data

Data compiled by: John E. Bartmess
De-protonation reactions
C8H4O4-2 + = C8H5O4-2
By formula: C8H4O4-2 + H+ = C8H5O4-2
Quantity | Value | Units | Method | Reference | Comment |
---|---|---|---|---|---|
ΔrH° | 1679. ± 13. | kJ/mol | D-EA | Yang, Fu, et al., 2004 | gas phase |

Ion clustering data

Data compiled by: John E. Bartmess
Clustering reactions
C8H4O4-2 + = C8H5O4-2
By formula: C8H4O4-2 + H+ = C8H5O4-2
Quantity | Value | Units | Method | Reference | Comment |
---|---|---|---|---|---|
ΔrH° | 1679. ± 13. | kJ/mol | D-EA | Yang, Fu, et al., 2004 | gas phase |
C8H5O4-2 + = C8H7O5-
By formula: C8H5O4-2 + H2O = C8H7O5-
Quantity | Value | Units | Method | Reference | Comment |
---|---|---|---|---|---|
ΔrH° | 60.2 ± 6.3 | kJ/mol | TDAs | Blades, Klassen, et al., 1995 | gas phase; T: 293 K. ΔSaff approx. 24 cal/mol-K |
Quantity | Value | Units | Method | Reference | Comment |
ΔrG° | 31.0 ± 1.3 | kJ/mol | TDAs | Blades, Klassen, et al., 1995 | gas phase; T: 293 K. ΔSaff approx. 24 cal/mol-K |

References

Yang, Fu, et al., 2004
Yang, X.; Fu, Y.J.; Wang, X.B.; Slavicek, P.; Mucha, M.; Jungwirth, P.; Wang, L.S.,
Solvent-mediated folding of a doubly charged anion,
J. Am. Chem. Soc., 2004, 126, 3, 876-883, https://doi.org/10.1021/ja038108c
. [all data]
Blades, Klassen, et al., 1995
Blades, A.T.; Klassen, J.S.; Kebarle, P.,
Free Energies of Hydration in the Gas Phase on the Anions of Some Oxo Acids of C, N, S, P, Cl and I,
J. Am. Chem. Soc., 1995, 117, 42, 10563, https://doi.org/10.1021/ja00147a019
. [all data]