1-Chloro-1,1,3,3,3-pentafluoropropane

Gas phase thermochemistry data

Data compiled by: Hussein Y. Afeefy, Joel F. Liebman, and Stephen E. Stein

Quantity Value Units Method Reference Comment
Δfgas-1151.5 ± 0.92kJ/molCcrSlavutskaya, Kolesov, et al., 1973Reanalyzed by Kolesov and Kozina, 1986, Original value = -1137.8 ± 0.75 kJ/mol

Condensed phase thermochemistry data

Data compiled as indicated in comments:
ALS - Hussein Y. Afeefy, Joel F. Liebman, and Stephen E. Stein
DH - Eugene S. Domalski and Elizabeth D. Hearing

Quantity Value Units Method Reference Comment
Δfliquid-281.63 ± 0.86kcal/molCcrSlavutskaya, Kolesov, et al., 1973Reanalyzed by Kolesov and Kozina, 1986, Original value = -278.36 ± 0.18 kcal/mol; ALS
Quantity Value Units Method Reference Comment
Δcliquid-288.27 ± 0.17kcal/molCcrSlavutskaya, Kolesov, et al., 1973ALS
Quantity Value Units Method Reference Comment
liquid96.479cal/mol*KN/AVorob'ev, Kolesov, et al., 1974DH

Constant pressure heat capacity of liquid

Cp,liquid (cal/mol*K) Temperature (K) Reference Comment
46.960298.15Vorob'ev, Kolesov, et al., 1974T = 12 to 300 K. Data in paper deposited at VINITI, No. 6783-73, 25 Sept. 1973.; DH

Phase change data

Data compiled as indicated in comments:
BS - Robert L. Brown and Stephen E. Stein
TRC - Thermodynamics Research Center, NIST Boulder Laboratories, Chris Muzny director
ALS - Hussein Y. Afeefy, Joel F. Liebman, and Stephen E. Stein
DH - Eugene S. Domalski and Elizabeth D. Hearing
AC - William E. Acree, Jr., James S. Chickos

Quantity Value Units Method Reference Comment
Tboil301.5KN/APCR Inc., 1990BS
Quantity Value Units Method Reference Comment
Ttriple165.42KN/AVorob'ev, Kolesov, et al., 1974Uncertainty assigned by TRC = 0.02 K; TRC
Quantity Value Units Method Reference Comment
Δvap6.42kcal/molESlavutskaya, Kolesov, et al., 1973ALS

Enthalpy of fusion

ΔfusH (kcal/mol) Temperature (K) Reference Comment
2.5031165.42Vorob'ev, Kolesov, et al., 1974DH
2.502165.4Domalski and Hearing, 1996AC

Entropy of fusion

ΔfusS (cal/mol*K) Temperature (K) Reference Comment
15.13165.42Vorob'ev, Kolesov, et al., 1974DH

In addition to the Thermodynamics Research Center (TRC) data available from this site, much more physical and chemical property data is available from the following TRC products:

References

Slavutskaya, Kolesov, et al., 1973
Slavutskaya, G.M.; Kolesov, V.P.; Durkina, G.S., Standard enthalpy of formation of 3-chloro-1,1,1,3,3-pentafluoropropane, Russ. J. Phys. Chem. (Engl. Transl.), 1973, 47, 1357. [all data]

Kolesov and Kozina, 1986
Kolesov, V.P.; Kozina, M.P., Thermochemistry of organic and organohalogen compounds, Russ. Chem. Rev., 1986, 55, 912. [all data]