3-Piperidinemethanol
- Formula: C6H13NO
- Molecular weight: 115.1735
- IUPAC Standard InChIKey: VUNPWIPIOOMCPT-UHFFFAOYSA-N
- CAS Registry Number: 4606-65-9
- Chemical structure:
View 3d structure (requires JavaScript / HTML 5) - Other names: piperidin-3-ylmethanol

Phase change data

Data compiled as indicated in comments:
BS - Robert L. Brown and Stephen E. Stein
AC - William E. Acree, Jr., James S. Chickos
Quantity | Value | Units | Method | Reference | Comment |
---|---|---|---|---|---|
ΔsubH° | 95.9 ± 1.4 | kJ/mol | C | Ribeiro da Silva and Cabral, 2006 | AC |
Reduced pressure boiling point
Tboil (K) | Pressure (bar) | Reference | Comment |
---|---|---|---|
379.7 | 0.005 | Weast and Grasselli, 1989 | BS |

References

Ribeiro da Silva and Cabral, 2006
Ribeiro da Silva, Manuel A.V.; Cabral, Joana I.T.A.,
Standard molar enthalpies of formation of 2-, 3-, and 4-piperidinomethanol isomers,
The Journal of Chemical Thermodynamics, 2006, 38, 8, 1008-1012, https://doi.org/10.1016/j.jct.2005.10.014
. [all data]
Weast and Grasselli, 1989
CRC Handbook of Data on Organic Compounds, 2nd Editon, Weast,R.C and Grasselli, J.G., ed(s)., CRC Press, Inc., Boca Raton, FL, 1989, 1. [all data]