Ethyl cyclopropanecarboxylate
- Formula: C6H10O2
- Molecular weight: 114.1424
- IUPAC Standard InChIKey: LDDOSDVZPSGLFZ-UHFFFAOYSA-N
- CAS Registry Number: 4606-07-9
- Chemical structure:
View 3d structure (requires JavaScript / HTML 5) - Other names: Cyclopropanecarboxylic acid ethyl ester; Ethyl cyclopropylcarboxylate

Condensed phase thermochemistry data

Data compiled by: Eugene S. Domalski and Elizabeth D. Hearing
Constant pressure heat capacity of liquid
Cp,liquid (J/mol*K) | Temperature (K) | Reference |
---|---|---|
213.0 | 298.15 | Fuchs, 1979 |

Phase change data

Data compiled by: Robert L. Brown and Stephen E. Stein
Quantity | Value | Units | Method | Reference | Comment |
---|---|---|---|---|---|
Tboil | 404.2 | K | N/A | Aldrich Chemical Company Inc., 1990 |

References

Fuchs, 1979
Fuchs, R.,
Heat capacities of some liquid aliphatic, alicyclic, and aromatic esters at 298.15 K,
J. Chem. Thermodyn., 1979, 11, 959-961. [all data]
Aldrich Chemical Company Inc., 1990
Aldrich Chemical Company Inc.,
Catalog Handbook of Fine Chemicals, Aldrich Chemical Company, Inc., Milwaukee WI, 1990, 1. [all data]