1,1,1-Trifluorobutane
- Formula: C4H7F3
- Molecular weight: 112.0936
- IUPAC Standard InChIKey: LDRPULCXZDDSGE-UHFFFAOYSA-N
- CAS Registry Number: 460-34-4
- Chemical structure:
View 3d structure (requires JavaScript / HTML 5) - Species with the same structure:

Phase change data

Data compiled by: William E. Acree, Jr., James S. Chickos
Enthalpy of vaporization
ΔvapH (kJ/mol) | Temperature (K) | Method | Reference | Comment |
---|---|---|---|---|
28.1 | 241. | A | Stephenson and Malanowski, 1987 | Based on data from 226. to 320. K. See also Dykyj, 1971. |

References

Stephenson and Malanowski, 1987
Stephenson, Richard M.; Malanowski, Stanislaw,
Handbook of the Thermodynamics of Organic Compounds, 1987, https://doi.org/10.1007/978-94-009-3173-2
. [all data]
Dykyj, 1971
Dykyj, J.,
Petrochemia, 1971, 11, 2, 27. [all data]