Ethene, 1-chloro-2-fluoro-
- Formula: C2H2ClF
- Molecular weight: 80.489
- IUPAC Standard InChIKey: MTKHTBWXSHYCGS-UHFFFAOYSA-N
- CAS Registry Number: 460-16-2
- Chemical structure:
View 3d structure (requires JavaScript / HTML 5) - Stereoisomers:
- Other names: Ethylene, 1-chloro-2-fluoro-; 1-Chloro-2-fluoroethylene; 1-Fluoro-2-chloroethylene

Phase change data

Data compiled by: Robert L. Brown and Stephen E. Stein
Quantity | Value | Units | Method | Reference | Comment |
---|---|---|---|---|---|
Tboil | 283. | K | N/A | PCR Inc., 1990 |

References

PCR Inc., 1990
PCR Inc.,
Research Chemicals Catalog 1990-1991, PCR Inc., Gainesville, FL, 1990, 1. [all data]